Building COHEmu for Windows

Here we speak about Code and Design.
starkravingmad
Posts: 24
Joined: Sun Apr 20, 2008 2:40 am

Post by starkravingmad » Fri Nov 03, 2006 11:34 am

[quote:1d73edc81c=\"calsmurf2904\"]
AdditionalDependencies="kernel32.lib user32.lib gdi32.lib winspool.lib comdlg32.lib advapi32.lib shell32.lib ole32.lib oleaut32.lib uuid.lib />
[/quote:1d73edc81c]

Looks like a typo. You are missing the " at the end.

uuid.lib[b:1d73edc81c]"[/b:1d73edc81c] />

calsmurf2904
Posts: 15
Joined: Sat Oct 28, 2006 6:34 pm

Post by calsmurf2904 » Fri Nov 03, 2006 1:20 pm

thank you it works now !

calsmurf2904
Posts: 15
Joined: Sat Oct 28, 2006 6:34 pm

Post by calsmurf2904 » Fri Nov 03, 2006 1:54 pm

I don't have this file in the ace lib folder : ACEd.dll it only have's the file .empty

and i get this error when i try to compile COHEMU.sln :
[list:1f51c44c82]1>------ Build started: Project: ZERO_CHECK, Configuration: Debug Win32 ------
1>Performing Post-Build Event...
1>"Checking build system"
1>Build log was saved at "file://c:\\COHEMU WIN32\\ZERO_CHECK.dir\\Debug\\BuildLog.htm"
1>ZERO_CHECK - 0 error(s), 0 warning(s)
2>------ Build started: Project: cohemu_common, Configuration: Debug Win32 ------
3>------ Build started: Project: authserver_lib, Configuration: Debug Win32 ------
3>Compiling...
2>Compiling...
3>authserverlist.cpp
2>Database.cpp
2>C:\\ACE_wrappers\\ace/config.h(1) : error C2001: newline in constant
3>C:\\ACE_wrappers\\ace/config.h(1) : error C2001: newline in constant
2>ServerManager.cpp
2>C:\\ACE_wrappers\\ace/config.h(1) : error C2001: newline in constant
3>ClientConnection.cpp
3>C:\\ACE_wrappers\\ace/config.h(1) : error C2001: newline in constant
2>ServerEndpoint.cpp
2>C:\\ACE_wrappers\\ace/config.h(1) : error C2001: newline in constant
3>AuthServer.cpp
3>C:\\ACE_wrappers\\ace/config.h(1) : error C2001: newline in constant
3>C:\\COHEMU\\Common\\include\\Config.h(61) : warning C4018: '>=' : signed/unsigned mismatch
2>PacketBase.cpp
2>C:\\ACE_wrappers\\ace/config.h(1) : error C2001: newline in constant
3>c:\\cohemu\\authserver\\src\\AuthServer.h(30) : fatal error C1083: Cannot open include file: 'boost/pool/object_pool.hpp': No such file or directory
3>AuthProtocol.cpp
2>GameProtocolHandler.cpp
3>C:\\ACE_wrappers\\ace/config.h(1) : error C2001: newline in constant
2>C:\\ACE_wrappers\\ace/config.h(1) : error C2001: newline in constant
3>AuthPacket.cpp
2>GameProtocol.cpp
3>C:\\ACE_wrappers\\ace/config.h(1) : error C2001: newline in constant
2>C:\\ACE_wrappers\\ace/config.h(1) : error C2001: newline in constant
3>AuthFSM.cpp
3>C:\\ACE_wrappers\\ace/config.h(1) : error C2001: newline in constant
2>PacketCodec.cpp
2>C:\\ACE_wrappers\\ace/config.h(1) : error C2001: newline in constant
2>server_support.cpp
2>C:\\ACE_wrappers\\ace/config.h(1) : error C2001: newline in constant
3>c:\\cohemu\\authserver\\src\\AuthServer.h(30) : fatal error C1083: Cannot open include file: 'boost/pool/object_pool.hpp': No such file or directory
3>AuthClientServicer.cpp
3>C:\\ACE_wrappers\\ace/config.h(1) : error C2001: newline in constant
2>NetManager.cpp
2>C:\\ACE_wrappers\\ace/config.h(1) : error C2001: newline in constant
3>AuthClient.cpp
2>MapServerInterface.cpp
2>C:\\ACE_wrappers\\ace/config.h(1) : error C2001: newline in constant
3>C:\\ACE_wrappers\\ace/config.h(1) : error C2001: newline in constant
3>Auth.cpp
3>C:\\ACE_wrappers\\ace/config.h(1) : error C2001: newline in constant
2>GameServerInterface.cpp
2>C:\\ACE_wrappers\\ace/config.h(1) : error C2001: newline in constant
3>Generating Code...
2>CRUDP_Protocol.cpp
2>C:\\ACE_wrappers\\ace/config.h(1) : error C2001: newline in constant
2>CRUDP_Packet.cpp
2>C:\\ACE_wrappers\\ace/config.h(1) : error C2001: newline in constant
2>Buffer.cpp
2>C:\\ACE_wrappers\\ace/config.h(1) : error C2001: newline in constant
2>BitStream.cpp
2>C:\\ACE_wrappers\\ace/config.h(1) : error C2001: newline in constant
2>..\\..\\..\\COHEMU\\Common\\src\\BitStream.cpp(290) : warning C4244: '=' : conversion from 'unsigned __int64' to 's32', possible loss of data
2>AuthServerInterface.cpp
2>C:\\ACE_wrappers\\ace/config.h(1) : error C2001: newline in constant
2>C:\\COHEMU\\AuthServer/include/AuthServer.h(30) : fatal error C1083: Cannot open include file: 'boost/pool/object_pool.hpp': No such file or directory
2>AdminServerInterface.cpp
2>C:\\ACE_wrappers\\ace/config.h(1) : error C2001: newline in constant
2>Generating Code...
3>Build log was saved at "file://c:\\COHEMU WIN32\\AuthServer\\src\\authserver_lib.dir\\Debug\\BuildLog.htm"
3>authserver_lib - 11 error(s), 1 warning(s)
2>Build log was saved at "file://c:\\COHEMU WIN32\\Common\\src\\cohemu_common.dir\\Debug\\BuildLog.htm"
2>cohemu_common - 18 error(s), 1 warning(s)
4>------ Build started: Project: gameserver_lib, Configuration: Debug Win32 ------
5>------ Build started: Project: adminserver_lib, Configuration: Debug Win32 ------
5>Compiling...
4>Compiling...
5>AdminDatabase.cpp
4>GameServerEndpoint.cpp
4>C:\\ACE_wrappers\\ace/config.h(1) : error C2001: newline in constant
5>C:\\ACE_wrappers\\ace/config.h(1) : error C2001: newline in constant
5>AdminServer.cpp
4>GameServer.cpp
4>C:\\ACE_wrappers\\ace/config.h(1) : error C2001: newline in constant
5>C:\\ACE_wrappers\\ace/config.h(1) : error C2001: newline in constant
5>C:\\COHEMU\\Common\\include\\Config.h(61) : warning C4018: '>=' : signed/unsigned mismatch
5>Generating Code...
4>C:\\COHEMU\\Common\\include\\Config.h(61) : warning C4018: '>=' : signed/unsigned mismatch
4>..\\..\\..\\COHEMU\\GameServer\\src\\GameServer.cpp(132) : warning C4244: 'initializing' : conversion from 'u64' to 'u32', possible loss of data
4>GamePacket.cpp
4>C:\\ACE_wrappers\\ace/config.h(1) : error C2001: newline in constant
4>ClientHandler.cpp
4>C:\\ACE_wrappers\\ace/config.h(1) : error C2001: newline in constant
4>..\\..\\..\\COHEMU\\GameServer\\src\\ClientHandler.cpp(72) : warning C4244: 'argument' : conversion from 'time_t' to 'unsigned int', possible loss of data
4>CharacterDatabase.cpp
4>C:\\ACE_wrappers\\ace/config.h(1) : error C2001: newline in constant
4>CharacterClient.cpp
4>C:\\ACE_wrappers\\ace/config.h(1) : error C2001: newline in constant
4>Character.cpp
4>C:\\ACE_wrappers\\ace/config.h(1) : error C2001: newline in constant
4>Generating Code...
5>Build log was saved at "file://c:\\COHEMU WIN32\\AdminServer\\src\\adminserver_lib.dir\\Debug\\BuildLog.htm"
5>adminserver_lib - 2 error(s), 1 warning(s)
4>Build log was saved at "file://c:\\COHEMU WIN32\\GameServer\\src\\gameserver_lib.dir\\Debug\\BuildLog.htm"
4>gameserver_lib - 7 error(s), 3 warning(s)
6>------ Build started: Project: mapserver_lib, Configuration: Debug Win32 ------
6>Compiling...
6>EntityStorage.cpp
6>C:\\ACE_wrappers\\ace/config.h(1) : error C2001: newline in constant
6>Entity.cpp
6>C:\\ACE_wrappers\\ace/config.h(1) : error C2001: newline in constant
6>..\\..\\..\\COHEMU\\MapServer\\src\\Entity.cpp(22) : warning C4244: 'initializing' : conversion from 'double' to 'float', possible loss of data
6>..\\..\\..\\COHEMU\\MapServer\\src\\Entity.cpp(34) : warning C4244: 'initializing' : conversion from 'double' to 'float', possible loss of data
6>..\\..\\..\\COHEMU\\MapServer\\src\\Entity.cpp(35) : warning C4244: '=' : conversion from 'double' to 'float', possible loss of data
6>..\\..\\..\\COHEMU\\MapServer\\src\\Entity.cpp(193) : warning C4244: 'initializing' : conversion from 'float' to 'int', possible loss of data
6>MapClient.cpp
6>C:\\ACE_wrappers\\ace/config.h(1) : error C2001: newline in constant
6>MapHandler.cpp
6>C:\\ACE_wrappers\\ace/config.h(1) : error C2001: newline in constant
6>..\\..\\..\\COHEMU\\MapServer\\src\\MapHandler.cpp(360) : warning C4305: 'argument' : truncation from 'double' to 'float'
6>..\\..\\..\\COHEMU\\MapServer\\src\\MapHandler.cpp(360) : warning C4305: 'argument' : truncation from 'double' to 'float'
6>..\\..\\..\\COHEMU\\MapServer\\src\\MapHandler.cpp(362) : warning C4305: 'argument' : truncation from 'double' to 'float'
6>..\\..\\..\\COHEMU\\MapServer\\src\\MapHandler.cpp(393) : warning C4305: 'argument' : truncation from 'double' to 'float'
6>..\\..\\..\\COHEMU\\MapServer\\src\\MapHandler.cpp(393) : warning C4305: 'argument' : truncation from 'double' to 'float'
6>..\\..\\..\\COHEMU\\MapServer\\src\\MapHandler.cpp(395) : warning C4305: 'argument' : truncation from 'double' to 'float'
6>..\\..\\..\\COHEMU\\MapServer\\src\\MapHandler.cpp(432) : warning C4305: 'argument' : truncation from 'double' to 'float'
6>..\\..\\..\\COHEMU\\MapServer\\src\\MapHandler.cpp(434) : warning C4305: 'argument' : truncation from 'double' to 'float'
6>MapServerEndpoint.cpp
6>C:\\ACE_wrappers\\ace/config.h(1) : error C2001: newline in constant
6>MapServer.cpp
6>C:\\ACE_wrappers\\ace/config.h(1) : error C2001: newline in constant
6>C:\\COHEMU\\Common\\include\\Config.h(61) : warning C4018: '>=' : signed/unsigned mismatch
6>Generating Code...
6>Build log was saved at "file://c:\\COHEMU WIN32\\MapServer\\src\\mapserver_lib.dir\\Debug\\BuildLog.htm"
6>mapserver_lib - 6 error(s), 13 warning(s)
7>------ Build started: Project: authserver, Configuration: Debug Win32 ------
7>Compiling...
7>main.cpp
7>C:\\ACE_wrappers\\ace/config.h(1) : error C2001: newline in constant
7>Build log was saved at "file://c:\\COHEMU WIN32\\AuthServer\\src\\authserver.dir\\Debug\\BuildLog.htm"
7>authserver - 1 error(s), 0 warning(s)
8>------ Skipped Build: Project: ALL_BUILD, Configuration: Debug Win32 ------
8>Project not selected to build for this solution configuration
9>------ Skipped Build: Project: INSTALL, Configuration: Debug Win32 ------
9>Project not selected to build for this solution configuration
========== Build: 1 succeeded, 6 failed, 0 up-to-date, 2 skipped ==========[/list:u:1f51c44c82]

starkravingmad
Posts: 24
Joined: Sun Apr 20, 2008 2:40 am

Post by starkravingmad » Fri Nov 03, 2006 2:45 pm

[quote:94614e7e76=\"calsmurf2904\"]I don't have this file in the ace lib folder : ACEd.dll it only have's the file .empty[/quote:94614e7e76]

Are you saying that \\ACE_wrappers\\lib has only the 1 file? After compiling ACE that directory should have 199 files. It sounds like the compiler placed your ACE libraries in a different location. If so, you need to do a search for ACEd.dll and find out where it is on your system. Once you have the location of ACEd.dll start CMake and edit the ACE entries.

calsmurf2904
Posts: 15
Joined: Sat Oct 28, 2006 6:34 pm

Post by calsmurf2904 » Fri Nov 03, 2006 5:45 pm

okay now i got the ace lib files but i get this error when i try to compile cohemu :
[list:eb0a6416f6]1>------ Build started: Project: ZERO_CHECK, Configuration: Debug Win32 ------
1>Performing Post-Build Event...
1>"Checking build system"
1>Build log was saved at "file://c:\\COHEMU WIN32\\ZERO_CHECK.dir\\Debug\\BuildLog.htm"
1>ZERO_CHECK - 0 error(s), 0 warning(s)
2>------ Build started: Project: cohemu_common, Configuration: Debug Win32 ------
3>------ Build started: Project: authserver_lib, Configuration: Debug Win32 ------
3>Compiling...
2>Compiling...
3>AuthServer.cpp
2>AuthServerInterface.cpp
3>C:\\COHEMU\\Common\\include\\Config.h(61) : warning C4018: '>=' : signed/unsigned mismatch
2>C:\\COHEMU\\AuthServer/include/AuthServer.h(30) : fatal error C1083: Cannot open include file: 'boost/pool/object_pool.hpp': No such file or directory
2>Build log was saved at "file://c:\\COHEMU WIN32\\Common\\src\\cohemu_common.dir\\Debug\\BuildLog.htm"
2>cohemu_common - 1 error(s), 0 warning(s)
3>c:\\cohemu\\authserver\\src\\AuthServer.h(30) : fatal error C1083: Cannot open include file: 'boost/pool/object_pool.hpp': No such file or directory
3>AuthFSM.cpp
3>c:\\cohemu\\authserver\\src\\AuthServer.h(30) : fatal error C1083: Cannot open include file: 'boost/pool/object_pool.hpp': No such file or directory
3>Generating Code...
3>Build log was saved at "file://c:\\COHEMU WIN32\\AuthServer\\src\\authserver_lib.dir\\Debug\\BuildLog.htm"
3>authserver_lib - 2 error(s), 1 warning(s)
4>------ Build started: Project: authserver, Configuration: Debug Win32 ------
4>Linking...
4>LINK : fatal error LNK1104: cannot open file 'cohemu_common.lib'
4>Build log was saved at "file://c:\\COHEMU WIN32\\AuthServer\\src\\authserver.dir\\Debug\\BuildLog.htm"
4>authserver - 1 error(s), 0 warning(s)
5>------ Skipped Build: Project: ALL_BUILD, Configuration: Debug Win32 ------
5>Project not selected to build for this solution configuration
6>------ Skipped Build: Project: INSTALL, Configuration: Debug Win32 ------
6>Project not selected to build for this solution configuration
========== Build: 1 succeeded, 3 failed, 3 up-to-date, 2 skipped ==========[/list:u:eb0a6416f6]

It gave a few errors when i compile ace maybe it is the fault ? :
[list:eb0a6416f6]1>------ Build started: Project: ACE, Configuration: Debug Win32 ------
2>------ Build started: Project: Library_Unload, Configuration: Debug Win32 ------
2>Compiling...
2>Unload_libACE.cpp
2>Compiling manifest to resources...
1>Compiling...
2>Linking...
1>XTI_ATM_Mcast.cpp
2>Embedding manifest...
2>Build log was saved at "file://c:\\ace\\ACE_wrappers\\tests\\Debug\\Library_Unload_vc8\\BuildLog.htm"
2>Library_Unload - 0 error(s), 0 warning(s)
1>XML_Svc_Conf.cpp
1>WIN32_Proactor.cpp
1>WIN32_Asynch_IO.cpp
1>WFMO_Reactor.cpp
1>UUID.cpp
1>UTF8_Encoding_Converter.cpp
1>UTF32_Encoding_Converter.cpp
1>UTF16_Encoding_Converter.cpp
1>UPIPE_Stream.cpp
1>UPIPE_Connector.cpp
1>UPIPE_Acceptor.cpp
1>UNIX_Addr.cpp
1>TTY_IO.cpp
1>TSS_Adapter.cpp
1>Trace.cpp
1>TP_Reactor.cpp
1>Token_Request_Reply.cpp
1>Token_Manager.cpp
1>Token_Invariants.cpp
1>Generating Code...
1>Compiling...
1>Token_Collection.cpp
1>Token.cpp
1>TLI_Stream.cpp
1>TLI_Connector.cpp
1>TLI_Acceptor.cpp
1>TLI.cpp
1>Timer_Wheel.cpp
1>Timer_Queue.cpp
1>Timer_List.cpp
1>Timer_Heap.cpp
1>Timer_Hash.cpp
1>Timeprobe.cpp
1>Time_Value.cpp
1>Time_Request_Reply.cpp
1>.\\Time_Request_Reply.cpp(39) : warning C4244: '=' : conversion from 'time_t' to 'ACE_UINT32', possible loss of data
1>.\\Time_Request_Reply.cpp(105) : warning C4244: '=' : conversion from 'time_t' to 'ACE_UINT32', possible loss of data
1>Thread_Semaphore.cpp
1>Thread_Mutex.cpp
1>Thread_Manager.cpp
1>Thread_Hook.cpp
1>Thread_Exit.cpp
1>Thread_Control.cpp
1>Generating Code...
1>Compiling...
1>Thread_Adapter.cpp
1>Thread.cpp
1>Task.cpp
1>System_Time.cpp
1>.\\System_Time.cpp(62) : warning C4244: '=' : conversion from 'time_t' to 'ACE_UINT32', possible loss of data
1>Synch_Options.cpp
1>Svc_Conf_y.cpp
1>Svc_Conf_Lexer.cpp
1>.\\Svc_Conf_Lexer.cpp(66) : warning C4351: new behavior: elements of array 'ace_yy_buffer_state::input_' will be default initialized
1>SV_Shared_Memory.cpp
1>SV_Semaphore_Simple.cpp
1>SV_Semaphore_Complex.cpp
1>SV_Message_Queue.cpp
1>SV_Message.cpp
1>SUN_Proactor.cpp
1>String_Base_Const.cpp
1>Stats.cpp
1>SString.cpp
1>SPIPE_Stream.cpp
1>SPIPE_Connector.cpp
1>SPIPE_Addr.cpp
1>SPIPE_Acceptor.cpp
1>Generating Code...
1>Compiling...
1>SPIPE.cpp
1>SOCK_Stream.cpp
1>SOCK_SEQPACK_Connector.cpp
1>SOCK_SEQPACK_Association.cpp
1>SOCK_SEQPACK_Acceptor.cpp
1>SOCK_Netlink.cpp
1>SOCK_IO.cpp
1>SOCK_Dgram_Mcast.cpp
1>SOCK_Dgram_Bcast.cpp
1>SOCK_Dgram.cpp
1>SOCK_Connector.cpp
1>Sock_Connect.cpp
1>SOCK_CODgram.cpp
1>SOCK_Acceptor.cpp
1>SOCK.cpp
1>Signal.cpp
1>Sig_Handler.cpp
1>Sig_Adapter.cpp
1>Shared_Object.cpp
1>Shared_Memory_SV.cpp
1>Generating Code...
1>Compiling...
1>Shared_Memory_Pool.cpp
1>Shared_Memory_MM.cpp
1>Shared_Memory.cpp
1>Service_Types.cpp
1>Service_Repository.cpp
1>Service_Object.cpp
1>Service_Manager.cpp
1>Service_Gestalt.cpp
1>Service_Config.cpp
1>Semaphore.cpp
1>Select_Reactor_Base.cpp
1>Sched_Params.cpp
1>Sbrk_Memory_Pool.cpp
1>Sample_History.cpp
1>RW_Thread_Mutex.cpp
1>RW_Process_Mutex.cpp
1>RW_Mutex.cpp
1>Remote_Tokens.cpp
1>Remote_Name_Space.cpp
1>Registry_Name_Space.cpp
1>Generating Code...
1>Compiling...
1>Registry.cpp
1>Refcountable.cpp
1>Recyclable.cpp
1>Recursive_Thread_Mutex.cpp
1>Read_Buffer.cpp
1>Reactor_Timer_Interface.cpp
1>Reactor_Notification_Strategy.cpp
1>Reactor_Impl.cpp
1>Reactor.cpp
1>Profile_Timer.cpp
1>Process_Semaphore.cpp
1>Process_Mutex.cpp
1>Process_Manager.cpp
1>Process.cpp
1>Proactor_Impl.cpp
1>Proactor.cpp
1>Priority_Reactor.cpp
1>POSIX_Proactor.cpp
1>POSIX_CB_Proactor.cpp
1>POSIX_Asynch_IO.cpp
1>Generating Code...
1>Compiling...
1>Pipe.cpp
1>Ping_Socket.cpp
1>PI_Malloc.cpp
1>Parse_Node.cpp
1>Pagefile_Memory_Pool.cpp
1>OS_TLI.cpp
1>OS_Thread_Adapter.cpp
1>OS_QoS.cpp
1>OS_NS_wchar.cpp
1>OS_NS_unistd.cpp
1>OS_NS_time.cpp
1>OS_NS_Thread.cpp
1>OS_NS_sys_wait.cpp
1>OS_NS_sys_utsname.cpp
1>OS_NS_sys_uio.cpp
1>OS_NS_sys_time.cpp
1>OS_NS_sys_stat.cpp
1>OS_NS_sys_socket.cpp
1>OS_NS_sys_shm.cpp
1>OS_NS_sys_sendfile.cpp
1>Generating Code...
1>Compiling...
1>OS_NS_sys_select.cpp
1>OS_NS_sys_resource.cpp
1>OS_NS_sys_msg.cpp
1>OS_NS_sys_mman.cpp
1>OS_NS_stropts.cpp
1>OS_NS_strings.cpp
1>OS_NS_string.cpp
1>OS_NS_stdlib.cpp
1>OS_NS_stdio.cpp
1>OS_NS_signal.cpp
1>OS_NS_regex.cpp
1>OS_NS_pwd.cpp
1>OS_NS_poll.cpp
1>OS_NS_netdb.cpp
1>OS_NS_math.cpp
1>OS_NS_fcntl.cpp
1>OS_NS_errno.cpp
1>OS_NS_dlfcn.cpp
1>OS_NS_dirent.cpp
1>OS_NS_ctype.cpp
1>Generating Code...
1>Compiling...
1>OS_NS_arpa_inet.cpp
1>OS_main.cpp
1>OS_Log_Msg_Attributes.cpp
1>OS_Errno.cpp
1>Object_Manager_Base.cpp
1>Object_Manager.cpp
1>Obchunk.cpp
1>NT_Service.cpp
1>Notification_Strategy.cpp
1>Netlink_Addr.cpp
1>Naming_Context.cpp
1>Name_Space.cpp
1>Name_Request_Reply.cpp
1>.\\Name_Request_Reply.cpp(49) : warning C4244: '=' : conversion from 'time_t' to 'ACE_UINT32', possible loss of data
1>.\\Name_Request_Reply.cpp(196) : warning C4244: '=' : conversion from 'time_t' to 'ACE_UINT32', possible loss of data
1>Name_Proxy.cpp
1>Mutex.cpp
1>Multihomed_INET_Addr.cpp
1>Msg_WFMO_Reactor.cpp
1>MMAP_Memory_Pool.cpp
1>.\\MMAP_Memory_Pool.cpp(261) : warning C4244: 'argument' : conversion from 'ACE_LOFF_T' to 'ssize_t', possible loss of data
1>.\\MMAP_Memory_Pool.cpp(286) : warning C4244: 'argument' : conversion from 'ACE_LOFF_T' to 'size_t', possible loss of data
1>.\\MMAP_Memory_Pool.cpp(400) : warning C4244: 'initializing' : conversion from 'ACE_LOFF_T' to 'const off_t', possible loss of data
1>Method_Request.cpp
1>Message_Queue.cpp
1>Generating Code...
1>Compiling...
1>Message_Block.cpp
1>c:\\ace\\ACE_wrappers\\ace/Message_Block.inl(620) : warning C4244: 'argument' : conversion from 'time_t' to 'unsigned long', possible loss of data
1>MEM_Stream.cpp
1>MEM_SAP.cpp
1>Mem_Map.cpp
1>MEM_IO.cpp
1>MEM_Connector.cpp
1>MEM_Addr.cpp
1>MEM_Acceptor.cpp
1>Manual_Event.cpp
1>Malloc_Allocator.cpp
1>Malloc.cpp
1>LSOCK_Stream.cpp
1>LSOCK_Dgram.cpp
1>LSOCK_Connector.cpp
1>LSOCK_CODgram.cpp
1>LSOCK_Acceptor.cpp
1>LSOCK.cpp
1>Logging_Strategy.cpp
1>Log_Record.cpp
1>c:\\ace\\ACE_wrappers\\ace/Log_Record.inl(39) : warning C4244: '=' : conversion from 'time_t' to 'ACE_UINT32', possible loss of data
1>Log_Msg_UNIX_Syslog.cpp
1>Generating Code...
1>Compiling...
1>Log_Msg_NT_Event_Log.cpp
1>Log_Msg_IPC.cpp
1>Log_Msg_Callback.cpp
1>Log_Msg_Backend.cpp
1>Log_Msg.cpp
1>Lock.cpp
1>Local_Tokens.cpp
1>Local_Name_Space.cpp
1>Local_Memory_Pool.cpp
1>Lib_Find.cpp
1>IPC_SAP.cpp
1>IOStream.cpp
1>IO_SAP.cpp
1>IO_Cntl_Msg.cpp
1>Init_ACE.cpp
1>INET_Addr.cpp
1>ICMP_Socket.cpp
1>High_Res_Timer.cpp
1>Hashable.cpp
1>Handle_Set.cpp
1>Generating Code...
1>Compiling...
1>Handle_Ops.cpp
1>gethrtime.cpp
1>Get_Opt.cpp
1>Functor_String.cpp
1>Functor.cpp
1>Framework_Component.cpp
1>Flag_Manip.cpp
1>Filecache.cpp
1>.\\Filecache.cpp(603) : warning C4244: 'argument' : conversion from 'ACE_LOFF_T' to 'ssize_t', possible loss of data
1>File_Lock.cpp
1>FILE_IO.cpp
1>FILE_Connector.cpp
1>FILE_Addr.cpp
1>FILE.cpp
1>FIFO_Send_Msg.cpp
1>FIFO_Send.cpp
1>FIFO_Recv_Msg.cpp
1>FIFO_Recv.cpp
1>FIFO.cpp
1>Event_Handler.cpp
1>Event.cpp
1>Generating Code...
1>Compiling...
1>Encoding_Converter_Factory.cpp
1>Encoding_Converter.cpp
1>Dynamic_Service_Dependency.cpp
1>Dynamic_Service_Base.cpp
1>Dynamic.cpp
1>Dump.cpp
1>DLL_Manager.cpp
1>DLL.cpp
1>Dirent_Selector.cpp
1>Dirent.cpp
1>Dev_Poll_Reactor.cpp
1>DEV_IO.cpp
1>DEV_Connector.cpp
1>DEV_Addr.cpp
1>DEV.cpp
1>Date_Time.cpp
1>Countdown_Time.cpp
1>Copy_Disabled.cpp
1>Containers.cpp
1>Connection_Recycling_Strategy.cpp
1>Generating Code...
1>Compiling...
1>Configuration_Import_Export.cpp
1>Configuration.cpp
1>Condition_Thread_Mutex.cpp
1>Condition_Recursive_Thread_Mutex.cpp
1>Codeset_Registry_db.cpp
1>Codeset_Registry.cpp
1>Codeset_IBM1047.cpp
1>Codecs.cpp
1>Cleanup.cpp
1>CDR_Stream.cpp
1>CDR_Size.cpp
1>CDR_Base.cpp
1>Capabilities.cpp
1>Basic_Types.cpp
1>Basic_Stats.cpp
1>Based_Pointer_Repository.cpp
1>Base_Thread_Adapter.cpp
1>Barrier.cpp
1>Auto_Event.cpp
1>Atomic_Op.cpp
1>Generating Code...
1>Compiling...
1>ATM_Stream.cpp
1>ATM_QoS.cpp
1>ATM_Params.cpp
1>ATM_Connector.cpp
1>ATM_Addr.cpp
1>ATM_Acceptor.cpp
1>Asynch_Pseudo_Task.cpp
1>Asynch_IO_Impl.cpp
1>Asynch_IO.cpp
1>Assert.cpp
1>Argv_Type_Converter.cpp
1>Addr.cpp
1>Active_Map_Manager.cpp
1>Activation_Queue.cpp
1>ACE_crc_ccitt.cpp
1>ACE_crc32.cpp
1>ACE.cpp
1>Generating Code...
1>Compiling...
1>Atomic_Op_Sparc.c
1>Compiling resources...
1>Compiling manifest to resources...
1>Linking...
1> Creating library ..\\lib\\ACEd.lib and object ..\\lib\\ACEd.exp
1>Embedding manifest...
1>Build log was saved at "file://c:\\ace\\ACE_wrappers\\ace\\Debug\\ACE_vc8\\BuildLog.htm"
1>ACE - 0 error(s), 12 warning(s)
3>------ Build started: Project: ASX_CCM_App_Lib, Configuration: Debug Win32 ------
4>------ Build started: Project: gperf, Configuration: Debug Win32 ------
3>Compiling...
4>Compiling...
3>CCM_App.cpp
4>Version.cpp
4>Vectors.cpp
4>Options.cpp
3>Compiling manifest to resources...
3>Linking...
3> Creating library ..\\..\\..\\lib\\ccm_appd.lib and object ..\\..\\..\\lib\\ccm_appd.exp
4>List_Node.cpp
3>Embedding manifest...
3>Build log was saved at "file://c:\\ace\\ACE_wrappers\\examples\\ASX\\CCM_App\\Debug\\ASX_CCM_App_Lib_vc8\\BuildLog.htm"
3>ASX_CCM_App_Lib - 0 error(s), 0 warning(s)
4>Key_List.cpp
5>------ Build started: Project: DLL_Test_Parent_Lib, Configuration: Debug Win32 ------
5>Compiling...
5>DLL_Test_Parent.cpp
4>Iterator.cpp
5>Compiling manifest to resources...
5>Linking...
5> Creating library ..\\lib\\DLL_Test_Parentd.lib and object ..\\lib\\DLL_Test_Parentd.exp
4>Hash_Table.cpp
5>Embedding manifest...
5>Build log was saved at "file://c:\\ace\\ACE_wrappers\\tests\\Debug\\DLL_Test_Parent_Lib_vc8\\BuildLog.htm"
5>DLL_Test_Parent_Lib - 0 error(s), 0 warning(s)
4>gperf.cpp
4>Gen_Perf.cpp
4>.\\Gen_Perf.cpp(254) : warning C4244: 'argument' : conversion from 'time_t' to 'u_int', possible loss of data
4>Bool_Array.cpp
6>------ Build started: Project: ACEXML, Configuration: Debug Win32 ------
6>Compiling...
6>ZipCharStream.cpp
6>XMLReader.cpp
4>Generating Code...
4>Compiling manifest to resources...
4>Linking...
4> Creating library ..\\..\\..\\bin\\gperf.lib and object ..\\..\\..\\bin\\gperf.exp
4>Embedding manifest...
6>XMLFilterImpl.cpp
4>Build log was saved at "file://c:\\ace\\ACE_wrappers\\apps\\gperf\\src\\Debug\\gperf_vc8\\BuildLog.htm"
4>gperf - 0 error(s), 1 warning(s)
7>------ Build started: Project: QoS, Configuration: Debug Win32 ------
7>Compiling...
7>SOCK_Dgram_Mcast_QoS.cpp
6>XML_Util.cpp
7>QoS_Session_Impl.cpp
6>XML_Codecs.cpp
7>QoS_Session_Factory.cpp
6>Validator.cpp
7>QoS_Manager.cpp
6>URL_Addr.cpp
7>QoS_Decorator.cpp
6>Transcode.cpp
7>Generating Code...
7>Compiling manifest to resources...
7>Linking...
6>StreamFactory.cpp
7> Creating library ..\\..\\lib\\ACE_QoSd.lib and object ..\\..\\lib\\ACE_QoSd.exp
7>Embedding manifest...
7>Build log was saved at "file://c:\\ace\\ACE_wrappers\\ace\\QoS\\Debug\\QoS_vc8\\BuildLog.htm"
7>QoS - 0 error(s), 0 warning(s)
8>------ Build started: Project: Gateway, Configuration: Debug Win32 ------
8>Compiling...
8>Options.cpp
6>StrCharStream.cpp
8>Gateway.cpp
6>SAXExceptions.cpp
6>NamespaceSupport.cpp
8>File_Parser.cpp
6>Mem_Map_Stream.cpp
8>Event_Forwarding_Discriminator.cpp
8>Event_Channel.cpp
6>LocatorImpl.cpp
6>Locator.cpp
8>Connection_Handler_Connector.cpp
6>InputSource.cpp
6>HttpCharStream.cpp
8>Connection_Handler_Acceptor.cpp
6>FileCharStream.cpp
8>Connection_Handler.cpp
6>.\\FileCharStream.cpp(40) : warning C4244: '=' : conversion from '__int64' to 'off_t', possible loss of data
6>Exception.cpp
6>ErrorHandler.cpp
8>Config_Files.cpp
6>Generating Code...
6>Compiling...
6>Env.cpp
8>Concrete_Connection_Handlers.cpp
6>EntityResolver.cpp
6>Encoding.cpp
8>Generating Code...
6>Element_Def_Builder.cpp
8>Compiling manifest to resources...
8>Linking...
8> Creating library ..\\..\\..\\lib\\Gatewayd.lib and object ..\\..\\..\\lib\\Gatewayd.exp
8>Embedding manifest...
6>DTDHandler.cpp
8>Build log was saved at "file://c:\\ace\\ACE_wrappers\\apps\\Gateway\\Gateway\\Debug\\Gateway_vc8\\BuildLog.htm"
8>Gateway - 0 error(s), 0 warning(s)
6>DTD_Manager.cpp
9>------ Build started: Project: Gateway_Peer, Configuration: Debug Win32 ------
9>Compiling...
9>Peer.cpp
6>DefaultHandler.cpp
6>ContentHandler.cpp
9>Options.cpp
6>CharStream.cpp
9>Generating Code...
9>Compiling manifest to resources...
9>Linking...
6>AttributesImpl.cpp
9> Creating library ..\\..\\..\\lib\\Gateway_Peerd.lib and object ..\\..\\..\\lib\\Gateway_Peerd.exp
9>Embedding manifest...
9>Build log was saved at "file://c:\\ace\\ACE_wrappers\\apps\\Gateway\\Peer\\Debug\\Gateway_Peer_vc8\\BuildLog.htm"
9>Gateway_Peer - 0 error(s), 0 warning(s)
10>------ Build started: Project: JAWS, Configuration: Debug Win32 ------
6>Attributes_Def_Builder.cpp
10>Compiling...
10>Parse_Headers.cpp
10>JAWS_Pipeline.cpp
6>Attributes.cpp
6>Generating Code...
6>Compiling manifest to resources...
6>Linking...
6> Creating library ..\\..\\lib\\ACEXMLd.lib and object ..\\..\\lib\\ACEXMLd.exp
10>JAWS_Concurrency.cpp
6>Embedding manifest...
6>Build log was saved at "file://c:\\ace\\ACE_wrappers\\ACEXML\\common\\Debug\\ACEXML_vc8\\BuildLog.htm"
6>ACEXML - 0 error(s), 1 warning(s)
10>IO.cpp
11>------ Build started: Project: JAWS3, Configuration: Debug Win32 ------
11>Compiling...
11>TPR_Concurrency.cpp
10>.\\IO.cpp(131) : warning C4244: 'argument' : conversion from 'ACE_LOFF_T' to 'size_t', possible loss of data
10>.\\IO.cpp(513) : warning C4244: 'initializing' : conversion from '__int64' to 'ssize_t', possible loss of data
10>HTTP_Server.cpp
11>TPOOL_Concurrency.cpp
10>HTTP_Response.cpp
11>Timer_Helpers.cpp
10>HTTP_Request.cpp
10>HTTP_Helpers.cpp
11>Timer.cpp
10>HTTP_Handler.cpp
11>THYBRID_Concurrency.cpp
10>HTTP_Config.cpp
10>Generating Code...
10>Compiling manifest to resources...
10>Linking...
10> Creating library ..\\..\\..\\lib\\JAWSd.lib and object ..\\..\\..\\lib\\JAWSd.exp
10>Embedding manifest...
11>Templates.cpp
10>Build log was saved at "file://c:\\ace\\ACE_wrappers\\apps\\JAWS\\server\\Debug\\JAWS_vc8\\BuildLog.htm"
10>JAWS - 0 error(s), 2 warning(s)
12>------ Build started: Project: Kokyu, Configuration: Debug Win32 ------
12>Compiling...
12>Kokyu_defs.cpp
12>Kokyu.cpp
11>Task_Timer.cpp
12>Dispatcher_Task.cpp
11>Synch_IO.cpp
11>Symbol_Table.cpp
12>Dispatcher_Impl.cpp
11>Signal_Task.cpp
12>Default_Dispatcher_Impl.cpp
11>Reactive_IO.cpp
12>Generating Code...
12>Compiling manifest to resources...
12>Linking...
12> Creating library ..\\lib\\Kokyud.lib and object ..\\lib\\Kokyud.exp
12>Embedding manifest...
11>Protocol_Handler.cpp
12>Build log was saved at "file://c:\\ace\\ACE_wrappers\\Kokyu\\Debug\\Kokyu_vc8\\BuildLog.htm"
12>Kokyu - 0 error(s), 0 warning(s)
13>------ Build started: Project: iinset, Configuration: Debug Win32 ------
13>Invoking ..\\..\\..\\bin\\gperf on idl.gperf
13>Compiling...
11>Options.cpp
13>test.cpp
13>idl.cpp
13>Generating Code...
13>Compiling manifest to resources...
13>Linking...
11>IO.cpp
13>Embedding manifest...
13>Build log was saved at "file://c:\\ace\\ACE_wrappers\\apps\\gperf\\tests\\Debug\\iinset_vc8\\BuildLog.htm"
13>iinset - 0 error(s), 0 warning(s)
11>FILE.cpp
14>------ Build started: Project: asnmp_lib, Configuration: Debug Win32 ------
14>Compiling...
14>wpdu.cpp
11>Event_Dispatcher.cpp
14>vb.cpp
14>transaction.cpp
11>Event_Completer.cpp
11>Datagram.cpp
14>timetick.cpp
14>target.cpp
11>Config_File.cpp
14>snmp.cpp
11>Concurrency.cpp
14>sagent.cpp
14>pdu.cpp
11>Generating Code...
14>oid.cpp
11>Compiling...
11>Asynch_IO.cpp
14>octet.cpp
11>Generating Code...
14>integer.cpp
11>Compiling manifest to resources...
11>Linking...
11> Creating library ..\\..\\..\\lib\\JAWS3d.lib and object ..\\..\\..\\lib\\JAWS3d.exp
14>gauge.cpp
11>Embedding manifest...
14>ctr64.cpp
14>counter.cpp
11>Build log was saved at "file://c:\\ace\\ACE_wrappers\\apps\\JAWS3\\jaws3\\Debug\\JAWS3_vc8\\BuildLog.htm"
11>JAWS3 - 0 error(s), 0 warning(s)
14>asn1.cpp
15>------ Build started: Project: ASX_CCM_App_Server, Configuration: Debug Win32 ------
15>Compiling...
14>address.cpp
15>SC_Server.cpp
14>Generating Code...
15>Compiling manifest to resources...
15>Linking...
14>Compiling manifest to resources...
14>Linking...
14> Creating library ..\\..\\lib\\asnmpd.lib and object ..\\..\\lib\\asnmpd.exp
15>Embedding manifest...
14>Embedding manifest...
15>Build log was saved at "file://c:\\ace\\ACE_wrappers\\examples\\ASX\\CCM_App\\Debug\\ASX_CCM_App_Server_vc8\\BuildLog.htm"
15>ASX_CCM_App_Server - 0 error(s), 0 warning(s)
16>------ Build started: Project: DLL_Newsweek, Configuration: Debug Win32 ------
14>Build log was saved at "file://c:\\ace\\ACE_wrappers\\ASNMP\\asnmp\\Debug\\asnmp_lib_vc8\\BuildLog.htm"
14>asnmp_lib - 0 error(s), 0 warning(s)
16>Compiling...
16>Newsweek.cpp
17>------ Build started: Project: DLL_Today, Configuration: Debug Win32 ------
16>Compiling manifest to resources...
17>Compiling...
17>Today.cpp
16>Linking...
17>Compiling manifest to resources...
17>Linking...
16> Creating library ..\\..\\lib\\DLL_Newsweekd.lib and object ..\\..\\lib\\DLL_Newsweekd.exp
17> Creating library ..\\..\\lib\\DLL_Todayd.lib and object ..\\..\\lib\\DLL_Todayd.exp
16>Embedding manifest...
17>Embedding manifest...
16>Build log was saved at "file://c:\\ace\\ACE_wrappers\\examples\\DLL\\Debug\\DLL_Newsweek_vc8\\BuildLog.htm"
16>DLL_Newsweek - 0 error(s), 0 warning(s)
17>Build log was saved at "file://c:\\ace\\ACE_wrappers\\examples\\DLL\\Debug\\DLL_Today_vc8\\BuildLog.htm"
17>DLL_Today - 0 error(s), 0 warning(s)
18>------ Build started: Project: websvcs, Configuration: Debug Win32 ------
18>Compiling...
18>URL_Addr.cpp
19>------ Build started: Project: ACEXML_Parser, Configuration: Debug Win32 ------
18>Compiling manifest to resources...
18>Linking...
19>Compiling...
18> Creating library ..\\..\\lib\\websvcsd.lib and object ..\\..\\lib\\websvcsd.exp
19>ParserInternals.cpp
18>Embedding manifest...
18>Build log was saved at "file://c:\\ace\\ACE_wrappers\\websvcs\\lib\\Debug\\websvcs_vc8\\BuildLog.htm"
18>websvcs - 0 error(s), 0 warning(s)
20>------ Build started: Project: Svc_Cfg_IPC_Server_Lib, Configuration: Debug Win32 ------
19>ParserContext.cpp
20>Compiling...
20>Handle_Timeout.cpp
19>Parser.cpp
20>Handle_Thr_Stream.cpp
19>Entity_Manager.cpp
20>Handle_R_Stream.cpp
19>Generating Code...
19>Compiling manifest to resources...
19>Linking...
19> Creating library ..\\..\\..\\lib\\ACEXML_Parserd.lib and object ..\\..\\..\\lib\\ACEXML_Parserd.exp
19>Embedding manifest...
19>Build log was saved at "file://c:\\ace\\ACE_wrappers\\ACEXML\\parser\\parser\\Debug\\ACEXML_Parser_vc8\\BuildLog.htm"
19>ACEXML_Parser - 0 error(s), 0 warning(s)
20>Handle_L_Stream.cpp
21>------ Build started: Project: Service_Configurator_Misc_Timer, Configuration: Debug Win32 ------
21>Compiling...
21>Timer_Service.cpp
20>Handle_L_SPIPE.cpp
21>Compiling manifest to resources...
21>Linking...
20>Handle_L_Pipe.cpp
21> Creating library ..\\..\\..\\lib\\timerd.lib and object ..\\..\\..\\lib\\timerd.exp
21>Embedding manifest...
21>Build log was saved at "file://c:\\ace\\ACE_wrappers\\examples\\Service_Configurator\\Misc\\Debug\\Service_Configurator_Misc_Timer_vc8\\BuildLog.htm"
21>Service_Configurator_Misc_Timer - 0 error(s), 0 warning(s)
20>Handle_L_FIFO.cpp
22>------ Build started: Project: Timer_Queue_Library, Configuration: Debug Win32 ------
22>Compiling...
22>Thread_Timer_Queue_Test.cpp
20>Handle_L_Dgram.cpp
20>Handle_L_CODgram.cpp
22>Reactor_Timer_Queue_Test.cpp
20>Handle_Broadcast.cpp
22>Driver.cpp
20>Generating Code...
20>Compiling manifest to resources...
20>Linking...
20> Creating library ..\\..\\..\\..\\lib\\IPC_Tests_Serverd.lib and object ..\\..\\..\\..\\lib\\IPC_Tests_Serverd.exp
20>Embedding manifest...
22>Async_Timer_Queue_Test.cpp
20>Build log was saved at "file://c:\\ace\\ACE_wrappers\\examples\\Service_Configurator\\IPC-tests\\server\\Debug\\Svc_Cfg_IPC_Server_Lib_vc8\\BuildLog.htm"
20>Svc_Cfg_IPC_Server_Lib - 0 error(s), 0 warning(s)
23>------ Build started: Project: Test_Output, Configuration: Debug Win32 ------
23>Compiling...
23>Test_Output.cpp
22>Generating Code...
22>Compiling manifest to resources...
22>Linking...
22> Creating library ..\\..\\lib\\tqtdd.lib and object ..\\..\\lib\\tqtdd.exp
22>Embedding manifest...
23>Compiling manifest to resources...
23>Linking...
23> Creating library ..\\lib\\Test_Outputd.lib and object ..\\lib\\Test_Outputd.exp
23>Embedding manifest...
22>Build log was saved at "file://c:\\ace\\ACE_wrappers\\examples\\Timer_Queue\\Debug\\Timer_Queue_Library_vc8\\BuildLog.htm"
22>Timer_Queue_Library - 0 error(s), 0 warning(s)
23>Build log was saved at "file://c:\\ace\\ACE_wrappers\\tests\\Debug\\Test_Output_vc8\\BuildLog.htm"
23>Test_Output - 0 error(s), 0 warning(s)
24>------ Build started: Project: Netsvsc_Client_Test_Lib, Configuration: Debug Win32 ------
24>Compiling...
24>Client_Test.cpp
25>------ Build started: Project: Netsvcs_Dump_Restore_Lib, Configuration: Debug Win32 ------
25>Compiling...
25>Dump_Restore.cpp
24>Compiling manifest to resources...
24>Linking...
24> Creating library ..\\..\\..\\..\\lib\\Client_Testd.lib and object ..\\..\\..\\..\\lib\\Client_Testd.exp
24>Embedding manifest...
24>Build log was saved at "file://c:\\ace\\ACE_wrappers\\netsvcs\\clients\\Naming\\Client\\Debug\\Netsvsc_Client_Test_Lib_vc8\\BuildLog.htm"
24>Netsvsc_Client_Test_Lib - 0 error(s), 0 warning(s)
26>------ Build started: Project: netsvcs, Configuration: Debug Win32 ------
26>Compiling...
26>TS_Server_Handler.cpp
25>Compiling manifest to resources...
25>Linking...
25> Creating library ..\\..\\..\\..\\lib\\Dump_Restored.lib and object ..\\..\\..\\..\\lib\\Dump_Restored.exp
25>Embedding manifest...
25>Build log was saved at "file://c:\\ace\\ACE_wrappers\\netsvcs\\clients\\Naming\\Dump_Restore\\Debug\\Netsvcs_Dump_Restore_Lib_vc8\\BuildLog.htm"
25>Netsvcs_Dump_Restore_Lib - 0 error(s), 0 warning(s)
26>.\\TS_Server_Handler.cpp(190) : warning C4244: 'argument' : conversion from 'time_t' to 'const ACE_UINT32', possible loss of data
27>------ Build started: Project: Synch_Lib, Configuration: Debug Win32 ------
27>Compiling...
26>TS_Clerk_Handler.cpp
27>Benchmark_Base.cpp
27>Compiling manifest to resources...
27>Linking...
27> Creating library ..\\..\\..\\lib\\Synch_Libd.lib and object ..\\..\\..\\lib\\Synch_Libd.exp
27>Embedding manifest...
26>.\\TS_Clerk_Handler.cpp(190) : warning C4244: 'initializing' : conversion from 'time_t' to 'ACE_UINT32', possible loss of data
26>.\\TS_Clerk_Handler.cpp(295) : warning C4244: '=' : conversion from 'time_t' to 'ACE_UINT32', possible loss of data
26>.\\TS_Clerk_Handler.cpp(353) : warning C4244: '=' : conversion from 'time_t' to 'long', possible loss of data
26>.\\TS_Clerk_Handler.cpp(421) : warning C4244: '=' : conversion from 'time_t' to 'long', possible loss of data
26>Token_Handler.cpp
27>Build log was saved at "file://c:\\ace\\ACE_wrappers\\performance-tests\\Synch-Benchmarks\\Synch_Lib\\Debug\\Synch_Lib_vc8\\BuildLog.htm"
27>Synch_Lib - 0 error(s), 0 warning(s)
28>------ Build started: Project: HTBP, Configuration: Debug Win32 ------
28>Compiling...
28>HTBP_Stream.cpp
26>Server_Logging_Handler_T.cpp
28>HTBP_Session.cpp
26>Server_Logging_Handler.cpp
28>HTBP_Outside_Squid_Filter.cpp
28>HTBP_Notifier.cpp
26>Name_Handler.cpp
28>HTBP_Inside_Squid_Filter.cpp
26>Log_Message_Receiver.cpp
26>Client_Logging_Handler.cpp
28>HTBP_ID_Requestor.cpp
26>Base_Optimizer.cpp
28>HTBP_Filter_Factory.cpp
26>Generating Code...
26>Compiling manifest to resources...
26>Linking...
26> Creating library ..\\..\\lib\\netsvcsd.lib and object ..\\..\\lib\\netsvcsd.exp
28>HTBP_Filter.cpp
26>Embedding manifest...
26>Build log was saved at "file://c:\\ace\\ACE_wrappers\\netsvcs\\lib\\Debug\\netsvcs_vc8\\BuildLog.htm"
26>netsvcs - 0 error(s), 5 warning(s)
29>------ Build started: Project: RMCast, Configuration: Debug Win32 ------
29>Compiling...
28>HTBP_Environment.cpp
29>Stack.cpp
28>HTBP_Channel.cpp
29>Socket.cpp
28>HTBP_Addr.cpp
29>Simulator.cpp
28>Generating Code...
29>.\\Simulator.cpp(12) : warning C4244: 'argument' : conversion from 'time_t' to 'unsigned int', possible loss of data
29>Retransmit.cpp
28>Compiling manifest to resources...
28>Linking...
28> Creating library ..\\..\\..\\lib\\ACE_HTBPd.lib and object ..\\..\\..\\lib\\ACE_HTBPd.exp
28>Embedding manifest...
29>Reassemble.cpp
28>Build log was saved at "file://c:\\ace\\ACE_wrappers\\protocols\\ace\\HTBP\\Debug\\HTBP_vc8\\BuildLog.htm"
28>HTBP - 0 error(s), 0 warning(s)
30>------ Build started: Project: TMCast, Configuration: Debug Win32 ------
30>Compiling...
30>Protocol.cpp
30>MTQueue.cpp
29>Protocol.cpp
30>Group.cpp
29>Link.cpp
30>Generating Code...
30>Compiling manifest to resources...
30>Linking...
30> Creating library ..\\..\\..\\lib\\ACE_TMCastd.lib and object ..\\..\\..\\lib\\ACE_TMCastd.exp
30>Embedding manifest...
29>.\\Link.cpp(33) : warning C4244: 'argument' : conversion from 'time_t' to 'unsigned int', possible loss of data
29>Fragment.cpp
30>Build log was saved at "file://c:\\ace\\ACE_wrappers\\protocols\\ace\\TMCast\\Debug\\TMCast_vc8\\BuildLog.htm"
30>TMCast - 0 error(s), 0 warning(s)
31>------ Build started: Project: Based_Pointer_Test_Lib, Configuration: Debug Win32 ------
31>Compiling...
31>Based_Pointer_Test_Lib.cpp
29>Flow.cpp
31>Compiling manifest to resources...
31>Linking...
31> Creating library ..\\lib\\Based_Pointer_Test_Libd.lib and object ..\\lib\\Based_Pointer_Test_Libd.exp
31>Embedding manifest...
31>Build log was saved at "file://c:\\ace\\ACE_wrappers\\tests\\Debug\\Based_Pointer_Test_Lib_vc8\\BuildLog.htm"
31>Based_Pointer_Test_Lib - 0 error(s), 0 warning(s)
29>Acknowledge.cpp
32>------ Build started: Project: DLL_Test_Lib, Configuration: Debug Win32 ------
32>Compiling...
32>DLL_Test_Impl.cpp
32>Compiling manifest to resources...
32>Linking...
32> Creating library ..\\lib\\DLL_Test_Libd.lib and object ..\\lib\\DLL_Test_Libd.exp
32>Embedding manifest...
29>Generating Code...
32>Build log was saved at "file://c:\\ace\\ACE_wrappers\\tests\\Debug\\DLL_Test_Lib_vc8\\BuildLog.htm"
32>DLL_Test_Lib - 0 error(s), 0 warning(s)
33>------ Build started: Project: Export_Lib, Configuration: Debug Win32 ------
33>Compiling...
33>dll.cpp
29>Compiling manifest to resources...
29>Linking...
29> Creating library ..\\..\\..\\lib\\ACE_RMCastd.lib and object ..\\..\\..\\lib\\ACE_RMCastd.exp
29>Embedding manifest...
33>Compiling manifest to resources...
33>Linking...
33> Creating library ..\\..\\lib\\Export_Libd.lib and object ..\\..\\lib\\Export_Libd.exp
29>Build log was saved at "file://c:\\ace\\ACE_wrappers\\protocols\\ace\\RMCast\\Debug\\RMCast_vc8\\BuildLog.htm"
29>RMCast - 0 error(s), 2 warning(s)
33>Embedding manifest...
33>Build log was saved at "file://c:\\ace\\ACE_wrappers\\examples\\Export\\Debug\\Export_Lib_vc8\\BuildLog.htm"
33>Export_Lib - 0 error(s), 0 warning(s)
34>------ Build started: Project: Service_Config_DLL, Configuration: Debug Win32 ------
35>------ Build started: Project: Framework_Component_DLL, Configuration: Debug Win32 ------
34>Compiling...
35>Compiling...
35>Framework_Component_DLL.cpp
34>Service_Config_DLL.cpp
34>Compiling manifest to resources...
35>Compiling manifest to resources...
35>Linking...
34>Linking...
34> Creating library ..\\lib\\Service_Config_DLLd.lib and object ..\\lib\\Service_Config_DLLd.exp
35> Creating library ..\\lib\\Framework_Component_DLLd.lib and object ..\\lib\\Framework_Component_DLLd.exp
35>Embedding manifest...
34>Embedding manifest...
35>Build log was saved at "file://c:\\ace\\ACE_wrappers\\tests\\Debug\\Framework_Component_DLL_vc8\\BuildLog.htm"
35>Framework_Component_DLL - 0 error(s), 0 warning(s)
34>Build log was saved at "file://c:\\ace\\ACE_wrappers\\tests\\Debug\\Service_Config_DLL_vc8\\BuildLog.htm"
34>Service_Config_DLL - 0 error(s), 0 warning(s)
36>------ Build started: Project: Semaphore_Test, Configuration: Debug Win32 ------
36>Compiling...
36>Semaphore_Test.cpp
37>------ Build started: Project: SV_Shared_Memory_Test, Configuration: Debug Win32 ------
37>Compiling...
36>.\\Semaphore_Test.cpp(204) : warning C4244: 'argument' : conversion from 'time_t' to 'u_int', possible loss of data
37>SV_Shared_Memory_Test.cpp
36>Main.cpp
36>Generating Code...
36>Compiling manifest to resources...
36>Linking...
36>Embedding manifest...
37>Main.cpp
36>Build log was saved at "file://c:\\ace\\ACE_wrappers\\tests\\Debug\\Semaphore_Test_vc8\\BuildLog.htm"
36>Semaphore_Test - 0 error(s), 1 warning(s)
37>Generating Code...
37>Compiling manifest to resources...
37>Linking...
37>Embedding manifest...
38>------ Build started: Project: SString_Test, Configuration: Debug Win32 ------
38>Compiling...
37>Build log was saved at "file://c:\\ace\\ACE_wrappers\\tests\\Debug\\SV_Shared_Memory_Test_vc8\\BuildLog.htm"
37>SV_Shared_Memory_Test - 0 error(s), 0 warning(s)
38>SString_Test.cpp
38>Main.cpp
39>------ Build started: Project: SPIPE_Test, Configuration: Debug Win32 ------
39>Compiling...
39>SPIPE_Test.cpp
38>Generating Code...
38>Compiling manifest to resources...
38>Linking...
38>Embedding manifest...
38>Build log was saved at "file://c:\\ace\\ACE_wrappers\\tests\\Debug\\SString_Test_vc8\\BuildLog.htm"
38>SString_Test - 0 error(s), 0 warning(s)
39>Main.cpp
39>Generating Code...
39>Compiling manifest to resources...
39>Linking...
40>------ Build started: Project: SOCK_Test, Configuration: Debug Win32 ------
39>Embedding manifest...
40>Compiling...
40>SOCK_Test.cpp
39>Build log was saved at "file://c:\\ace\\ACE_wrappers\\tests\\Debug\\SPIPE_Test_vc8\\BuildLog.htm"
39>SPIPE_Test - 0 error(s), 0 warning(s)
41>------ Build started: Project: SOCK_Test_IPv6, Configuration: Debug Win32 ------
41>Compiling...
41>SOCK_Test_IPv6.cpp
40>Main.cpp
40>Generating Code...
40>Compiling manifest to resources...
40>Linking...
40>Embedding manifest...
41>Main.cpp
40>Build log was saved at "file://c:\\ace\\ACE_wrappers\\tests\\Debug\\SOCK_Test_vc8\\BuildLog.htm"
40>SOCK_Test - 0 error(s), 0 warning(s)
41>Generating Code...
41>Compiling manifest to resources...
41>Linking...
42>------ Build started: Project: SOCK_Send_Recv_Test, Configuration: Debug Win32 ------
42>Compiling...
42>SOCK_Send_Recv_Test.cpp
41>Embedding manifest...
41>Build log was saved at "file://c:\\ace\\ACE_wrappers\\tests\\Debug\\SOCK_Test_IPv6_vc8\\BuildLog.htm"
41>SOCK_Test_IPv6 - 0 error(s), 0 warning(s)
42>Main.cpp
42>Generating Code...
42>Compiling manifest to resources...
42>Linking...
42>Embedding manifest...
43>------ Build started: Project: SOCK_Send_Recv_Test_IPV6, Configuration: Debug Win32 ------
43>Compiling...
43>SOCK_Send_Recv_Test_IPV6.cpp
42>Build log was saved at "file://c:\\ace\\ACE_wrappers\\tests\\Debug\\SOCK_Send_Recv_Test_vc8\\BuildLog.htm"
42>SOCK_Send_Recv_Test - 0 error(s), 0 warning(s)
43>Main.cpp
44>------ Build started: Project: SOCK_SEQPACK_SCTP_Test, Configuration: Debug Win32 ------
44>Compiling...
43>Generating Code...
44>SOCK_SEQPACK_SCTP_Test.cpp
43>Compiling manifest to resources...
43>Linking...
43>Embedding manifest...
43>Build log was saved at "file://c:\\ace\\ACE_wrappers\\tests\\Debug\\SOCK_Send_Recv_Test_IPV6_vc8\\BuildLog.htm"
43>SOCK_Send_Recv_Test_IPV6 - 0 error(s), 0 warning(s)
45>------ Build started: Project: SOCK_Netlink_Test, Configuration: Debug Win32 ------
45>Compiling...
45>SOCK_Netlink_Test.cpp
44>Main.cpp
44>Generating Code...
44>Compiling manifest to resources...
44>Linking...
45>Main.cpp
44>Embedding manifest...
45>Generating Code...
45>Compiling manifest to resources...
45>Linking...
44>Build log was saved at "file://c:\\ace\\ACE_wrappers\\tests\\Debug\\SOCK_SEQPACK_SCTP_Test_vc8\\BuildLog.htm"
44>SOCK_SEQPACK_SCTP_Test - 0 error(s), 0 warning(s)
45>Embedding manifest...
45>Build log was saved at "file://c:\\ace\\ACE_wrappers\\tests\\Debug\\SOCK_Netlink_Test_vc8\\BuildLog.htm"
45>SOCK_Netlink_Test - 0 error(s), 0 warning(s)
46>------ Build started: Project: SOCK_Dgram_Test, Configuration: Debug Win32 ------
47>------ Build started: Project: SOCK_Dgram_Bcast_Test, Configuration: Debug Win32 ------
46>Compiling...
47>Compiling...
46>SOCK_Dgram_Test.cpp
47>SOCK_Dgram_Bcast_Test.cpp
46>Main.cpp
47>Main.cpp
46>Generating Code...
46>Compiling manifest to resources...
47>Generating Code...
46>Linking...
47>Compiling manifest to resources...
47>Linking...
46>Embedding manifest...
47>Embedding manifest...
46>Build log was saved at "file://c:\\ace\\ACE_wrappers\\tests\\Debug\\SOCK_Dgram_Test_vc8\\BuildLog.htm"
46>SOCK_Dgram_Test - 0 error(s), 0 warning(s)
47>Build log was saved at "file://c:\\ace\\ACE_wrappers\\tests\\Debug\\SOCK_Dgram_Bcast_Test_vc8\\BuildLog.htm"
47>SOCK_Dgram_Bcast_Test - 0 error(s), 0 warning(s)
48>------ Build started: Project: SOCK_Connector_Test, Configuration: Debug Win32 ------
48>Compiling...
48>SOCK_Connector_Test.cpp
49>------ Build started: Project: Reverse_Lock_Test, Configuration: Debug Win32 ------
49>Compiling...
49>Reverse_Lock_Test.cpp
48>Main.cpp
49>Main.cpp
48>Generating Code...
48>Compiling manifest to resources...
48>Linking...
48>Embedding manifest...
49>Generating Code...
49>Compiling manifest to resources...
49>Linking...
48>Build log was saved at "file://c:\\ace\\ACE_wrappers\\tests\\Debug\\SOCK_Connector_Test_vc8\\BuildLog.htm"
48>SOCK_Connector_Test - 0 error(s), 0 warning(s)
49>Embedding manifest...
50>------ Build started: Project: Reference_Counted_Event_Handler_Test, Configuration: Debug Win32 ------
50>Compiling...
50>Reference_Counted_Event_Handler_Test.cpp
49>Build log was saved at "file://c:\\ace\\ACE_wrappers\\tests\\Debug\\Reverse_Lock_Test_vc8\\BuildLog.htm"
49>Reverse_Lock_Test - 0 error(s), 0 warning(s)
51>------ Build started: Project: Refcounted_Auto_Ptr_Test, Configuration: Debug Win32 ------
51>Compiling...
51>Refcounted_Auto_Ptr_Test.cpp
50>Main.cpp
50>Generating Code...
50>Compiling manifest to resources...
50>Linking...
50> Creating library .\\Reference_Counted_Event_Handler_Test.lib and object .\\Reference_Counted_Event_Handler_Test.exp
50>Embedding manifest...
50>Build log was saved at "file://c:\\ace\\ACE_wrappers\\tests\\Debug\\Reference_Counted_Event_Handler_Test_vc8\\BuildLog.htm"
50>Reference_Counted_Event_Handler_Test - 0 error(s), 0 warning(s)
51>Main.cpp
51>Generating Code...
51>Compiling manifest to resources...
51>Linking...
51> Creating library .\\Refcounted_Auto_Ptr_Test.lib and object .\\Refcounted_Auto_Ptr_Test.exp
52>------ Build started: Project: Recursive_Mutex_Test, Configuration: Debug Win32 ------
51>Embedding manifest...
52>Compiling...
52>Recursive_Mutex_Test.cpp
51>Build log was saved at "file://c:\\ace\\ACE_wrappers\\tests\\Debug\\Refcounted_Auto_Ptr_Test_vc8\\BuildLog.htm"
51>Refcounted_Auto_Ptr_Test - 0 error(s), 0 warning(s)
52>.\\Recursive_Mutex_Test.cpp(94) : warning C4244: 'argument' : conversion from 'time_t' to 'u_int', possible loss of data
52>Main.cpp
52>Generating Code...
52>Compiling manifest to resources...
52>Linking...
52>Embedding manifest...
53>------ Build started: Project: Recursive_Condition_Test, Configuration: Debug Win32 ------
53>Compiling...
53>Recursive_Condition_Test.cpp
52>Build log was saved at "file://c:\\ace\\ACE_wrappers\\tests\\Debug\\Recursive_Mutex_Test_vc8\\BuildLog.htm"
52>Recursive_Mutex_Test - 0 error(s), 1 warning(s)
54>------ Build started: Project: Recursive_Condition_Bug_Test, Configuration: Debug Win32 ------
54>Compiling...
54>Recursive_Condition_Bug_Test.cpp
53>Main.cpp
53>Generating Code...
53>Compiling manifest to resources...
53>Linking...
53> Creating library .\\Recursive_Condition_Test.lib and object .\\Recursive_Condition_Test.exp
53>Embedding manifest...
54>Main.cpp
53>Build log was saved at "file://c:\\ace\\ACE_wrappers\\tests\\Debug\\Recursive_Condition_Test_vc8\\BuildLog.htm"
53>Recursive_Condition_Test - 0 error(s), 0 warning(s)
54>Generating Code...
54>Compiling manifest to resources...
54>Linking...
54> Creating library .\\Recursive_Condition_Bug_Test.lib and object .\\Recursive_Condition_Bug_Test.exp
54>Embedding manifest...
55>------ Build started: Project: Reader_Writer_Test, Configuration: Debug Win32 ------
54>Build log was saved at "file://c:\\ace\\ACE_wrappers\\tests\\Debug\\Recursive_Condition_Bug_Test_vc8\\BuildLog.htm"
54>Recursive_Condition_Bug_Test - 0 error(s), 0 warning(s)
55>Compiling...
55>Reader_Writer_Test.cpp
55>Main.cpp
55>Generating Code...
55>Compiling manifest to resources...
55>Linking...
55>Embedding manifest...
56>------ Build started: Project: Reactors_Test, Configuration: Debug Win32 ------
56>Compiling...
56>Reactors_Test.cpp
55>Build log was saved at "file://c:\\ace\\ACE_wrappers\\tests\\Debug\\Reader_Writer_Test_vc8\\BuildLog.htm"
55>Reader_Writer_Test - 0 error(s), 0 warning(s)
57>------ Build started: Project: Reactor_Timer_Test, Configuration: Debug Win32 ------
57>Compiling...
57>Reactor_Timer_Test.cpp
56>Main.cpp
56>Generating Code...
56>Compiling manifest to resources...
56>Linking...
56>Embedding manifest...
57>Main.cpp
56>Build log was saved at "file://c:\\ace\\ACE_wrappers\\tests\\Debug\\Reactors_Test_vc8\\BuildLog.htm"
56>Reactors_Test - 0 error(s), 0 warning(s)
57>Generating Code...
57>Compiling manifest to resources...
57>Linking...
57>Embedding manifest...
58>------ Build started: Project: Reactor_Registration_Test, Configuration: Debug Win32 ------
58>Compiling...
58>Reactor_Registration_Test.cpp
57>Build log was saved at "file://c:\\ace\\ACE_wrappers\\tests\\Debug\\Reactor_Timer_Test_vc8\\BuildLog.htm"
57>Reactor_Timer_Test - 0 error(s), 0 warning(s)
59>------ Build started: Project: Reactor_Performance_Test, Configuration: Debug Win32 ------
59>Compiling...
59>Reactor_Performance_Test.cpp
58>Main.cpp
58>Generating Code...
58>Compiling manifest to resources...
58>Linking...
58>Embedding manifest...
58>Build log was saved at "file://c:\\ace\\ACE_wrappers\\tests\\Debug\\Reactor_Registration_Test_vc8\\BuildLog.htm"
58>Reactor_Registration_Test - 0 error(s), 0 warning(s)
59>Main.cpp
60>------ Build started: Project: Reactor_Notify_Test, Configuration: Debug Win32 ------
60>Compiling...
60>Reactor_Notify_Test.cpp
59>Generating Code...
59>Compiling manifest to resources...
59>Linking...
59> Creating library .\\Reactor_Performance_Test.lib and object .\\Reactor_Performance_Test.exp
59>Embedding manifest...
59>Build log was saved at "file://c:\\ace\\ACE_wrappers\\tests\\Debug\\Reactor_Performance_Test_vc8\\BuildLog.htm"
59>Reactor_Performance_Test - 0 error(s), 0 warning(s)
60>Main.cpp
60>Generating Code...
60>Compiling manifest to resources...
60>Linking...
60> Creating library .\\Reactor_Notify_Test.lib and object .\\Reactor_Notify_Test.exp
60>Embedding manifest...
61>------ Build started: Project: Reactor_Notification_Queue_Test, Configuration: Debug Win32 ------
61>Compiling...
61>Reactor_Notification_Queue_Test.cpp
60>Build log was saved at "file://c:\\ace\\ACE_wrappers\\tests\\Debug\\Reactor_Notify_Test_vc8\\BuildLog.htm"
60>Reactor_Notify_Test - 0 error(s), 0 warning(s)
62>------ Build started: Project: Reactor_Exceptions_Test, Configuration: Debug Win32 ------
62>Compiling...
61>Main.cpp
62>Reactor_Exceptions_Test.cpp
61>Generating Code...
61>Compiling manifest to resources...
61>Linking...
61>Embedding manifest...
62>Main.cpp
61>Build log was saved at "file://c:\\ace\\ACE_wrappers\\tests\\Debug\\Reactor_Notification_Queue_Test_vc8\\BuildLog.htm"
61>Reactor_Notification_Queue_Test - 0 error(s), 0 warning(s)
62>Generating Code...
62>Compiling manifest to resources...
62>Linking...
63>------ Build started: Project: Reactor_Dispatch_Order_Test, Configuration: Debug Win32 ------
62>Embedding manifest...
63>Compiling...
63>Reactor_Dispatch_Order_Test.cpp
62>Build log was saved at "file://c:\\ace\\ACE_wrappers\\tests\\Debug\\Reactor_Exceptions_Test_vc8\\BuildLog.htm"
62>Reactor_Exceptions_Test - 0 error(s), 0 warning(s)
64>------ Build started: Project: RB_Tree_Test, Configuration: Debug Win32 ------
64>Compiling...
64>RB_Tree_Test.cpp
63>Main.cpp
63>Generating Code...
64>Main.cpp
63>Compiling manifest to resources...
63>Linking...
63> Creating library .\\Reactor_Dispatch_Order_Test.lib and object .\\Reactor_Dispatch_Order_Test.exp
64>Generating Code...
63>Embedding manifest...
64>Compiling manifest to resources...
64>Linking...
63>Build log was saved at "file://c:\\ace\\ACE_wrappers\\tests\\Debug\\Reactor_Dispatch_Order_Test_vc8\\BuildLog.htm"
63>Reactor_Dispatch_Order_Test - 0 error(s), 0 warning(s)
64>Embedding manifest...
64>Build log was saved at "file://c:\\ace\\ACE_wrappers\\tests\\Debug\\RB_Tree_Test_vc8\\BuildLog.htm"
64>RB_Tree_Test - 0 error(s), 0 warning(s)
65>------ Build started: Project: Process_Strategy_Test, Configuration: Debug Win32 ------
65>Compiling...
65>Process_Strategy_Test.cpp
66>------ Build started: Project: Process_Semaphore_Test, Configuration: Debug Win32 ------
66>Compiling...
66>Process_Semaphore_Test.cpp
66>Main.cpp
66>Generating Code...
66>Compiling manifest to resources...
66>Linking...
66>Embedding manifest...
65>Main.cpp
66>Build log was saved at "file://c:\\ace\\ACE_wrappers\\tests\\Debug\\Process_Semaphore_Test_vc8\\BuildLog.htm"
66>Process_Semaphore_Test - 0 error(s), 0 warning(s)
65>Generating Code...
67>------ Build started: Project: Process_Mutex_Test, Configuration: Debug Win32 ------
65>Compiling manifest to resources...
65>Linking...
67>Compiling...
65> Creating library .\\Process_Strategy_Test.lib and object .\\Process_Strategy_Test.exp
67>Process_Mutex_Test.cpp
65>Embedding manifest...
65>Build log was saved at "file://c:\\ace\\ACE_wrappers\\tests\\Debug\\Process_Strategy_Test_vc8\\BuildLog.htm"
65>Process_Strategy_Test - 0 error(s), 0 warning(s)
67>Main.cpp
67>Generating Code...
68>------ Build started: Project: Process_Manual_Event_Test, Configuration: Debug Win32 ------
67>Compiling manifest to resources...
67>Linking...
68>Compiling...
68>Process_Manual_Event_Test.cpp
67>Embedding manifest...
67>Build log was saved at "file://c:\\ace\\ACE_wrappers\\tests\\Debug\\Process_Mutex_Test_vc8\\BuildLog.htm"
67>Process_Mutex_Test - 0 error(s), 0 warning(s)
68>Main.cpp
68>Generating Code...
68>Compiling manifest to resources...
68>Linking...
68>Embedding manifest...
69>------ Build started: Project: Process_Manager_Test, Configuration: Debug Win32 ------
68>Build log was saved at "file://c:\\ace\\ACE_wrappers\\tests\\Debug\\Process_Manual_Event_Test_vc8\\BuildLog.htm"
68>Process_Manual_Event_Test - 0 error(s), 0 warning(s)
69>Compiling...
69>Process_Manager_Test.cpp
69>Main.cpp
69>Generating Code...
69>Compiling manifest to resources...
69>Linking...
69>Embedding manifest...
70>------ Build started: Project: Proactor_Timer_Test, Configuration: Debug Win32 ------
70>Compiling...
70>Proactor_Timer_Test.cpp
70>Main.cpp
70>Generating Code...
70>Compiling manifest to resources...
70>Linking...
69>Build log was saved at "file://c:\\ace\\ACE_wrappers\\tests\\Debug\\Process_Manager_Test_vc8\\BuildLog.htm"
69>Process_Manager_Test - 0 error(s), 0 warning(s)
70>Embedding manifest...
71>------ Build started: Project: Proactor_Test, Configuration: Debug Win32 ------
71>Compiling...
71>Proactor_Test.cpp
70>Build log was saved at "file://c:\\ace\\ACE_wrappers\\tests\\Debug\\Proactor_Timer_Test_vc8\\BuildLog.htm"
70>Proactor_Timer_Test - 0 error(s), 0 warning(s)
72>------ Build started: Project: Proactor_Test_IPV6, Configuration: Debug Win32 ------
72>Compiling...
72>Proactor_Test_IPV6.cpp
71>Main.cpp
71>Generating Code...
71>Compiling manifest to resources...
71>Linking...
71> Creating library .\\Proactor_Test.lib and object .\\Proactor_Test.exp
71>Embedding manifest...
72>Main.cpp
71>Build log was saved at "file://c:\\ace\\ACE_wrappers\\tests\\Debug\\Proactor_Test_vc8\\BuildLog.htm"
71>Proactor_Test - 0 error(s), 0 warning(s)
72>Generating Code...
72>Compiling manifest to resources...
72>Linking...
72> Creating library .\\Proactor_Test_IPV6.lib and object .\\Proactor_Test_IPV6.exp
73>------ Build started: Project: Proactor_Scatter_Gather_Test, Configuration: Debug Win32 ------
73>Compiling...
73>Proactor_Scatter_Gather_Test.cpp
72>Embedding manifest...
72>Build log was saved at "file://c:\\ace\\ACE_wrappers\\tests\\Debug\\Proactor_Test_IPV6_vc8\\BuildLog.htm"
72>Proactor_Test_IPV6 - 0 error(s), 0 warning(s)
74>------ Build started: Project: Priority_Task_Test, Configuration: Debug Win32 ------
74>Compiling...
74>Priority_Task_Test.cpp
73>.\\Proactor_Scatter_Gather_Test.cpp(1153) : warning C4244: 'initializing' : conversion from 'ACE_LOFF_T' to 'const size_t', possible loss of data
73>Main.cpp
73>Generating Code...
73>Compiling manifest to resources...
73>Linking...
73> Creating library .\\Proactor_Scatter_Gather_Test.lib and object .\\Proactor_Scatter_Gather_Test.exp
73>Embedding manifest...
74>Main.cpp
73>Build log was saved at "file://c:\\ace\\ACE_wrappers\\tests\\Debug\\Proactor_Scatter_Gather_Test_vc8\\BuildLog.htm"
73>Proactor_Scatter_Gather_Test - 0 error(s), 1 warning(s)
75>------ Build started: Project: Priority_Reactor_Test, Configuration: Debug Win32 ------
75>Compiling...
74>Generating Code...
75>Priority_Reactor_Test.cpp
74>Compiling manifest to resources...
74>Linking...
74>Embedding manifest...
74>Build log was saved at "file://c:\\ace\\ACE_wrappers\\tests\\Debug\\Priority_Task_Test_vc8\\BuildLog.htm"
74>Priority_Task_Test - 0 error(s), 0 warning(s)
76>------ Build started: Project: Priority_Buffer_Test, Configuration: Debug Win32 ------
76>Compiling...
76>Priority_Buffer_Test.cpp
75>Main.cpp
75>Generating Code...
75>Compiling manifest to resources...
75>Linking...
75> Creating library .\\Priority_Reactor_Test.lib and object .\\Priority_Reactor_Test.exp
76>Main.cpp
75>Embedding manifest...
76>Generating Code...
75>Build log was saved at "file://c:\\ace\\ACE_wrappers\\tests\\Debug\\Priority_Reactor_Test_vc8\\BuildLog.htm"
75>Priority_Reactor_Test - 0 error(s), 0 warning(s)
77>------ Build started: Project: Pipe_Test, Configuration: Debug Win32 ------
76>Compiling manifest to resources...
76>Linking...
77>Compiling...
76> Creating library .\\Priority_Buffer_Test.lib and object .\\Priority_Buffer_Test.exp
77>Pipe_Test.cpp
76>Embedding manifest...
76>Build log was saved at "file://c:\\ace\\ACE_wrappers\\tests\\Debug\\Priority_Buffer_Test_vc8\\BuildLog.htm"
76>Priority_Buffer_Test - 0 error(s), 0 warning(s)
77>Main.cpp
77>Generating Code...
77>Compiling manifest to resources...
77>Linking...
77>Embedding manifest...
78>------ Build started: Project: OrdMultiSet_Test, Configuration: Debug Win32 ------
78>Compiling...
78>OrdMultiSet_Test.cpp
77>Build log was saved at "file://c:\\ace\\ACE_wrappers\\tests\\Debug\\Pipe_Test_vc8\\BuildLog.htm"
77>Pipe_Test - 0 error(s), 0 warning(s)
78>Main.cpp
78>Generating Code...
79>------ Build started: Project: Obstack_Test, Configuration: Debug Win32 ------
78>Compiling manifest to resources...
79>Compiling...
78>Linking...
79>Obstack_Test.cpp
78>Embedding manifest...
78>Build log was saved at "file://c:\\ace\\ACE_wrappers\\tests\\Debug\\OrdMultiSet_Test_vc8\\BuildLog.htm"
78>OrdMultiSet_Test - 0 error(s), 0 warning(s)
79>Main.cpp
79>Generating Code...
79>Compiling manifest to resources...
79>Linking...
79>Embedding manifest...
80>------ Build started: Project: Object_Manager_Test, Configuration: Debug Win32 ------
79>Build log was saved at "file://c:\\ace\\ACE_wrappers\\tests\\Debug\\Obstack_Test_vc8\\BuildLog.htm"
79>Obstack_Test - 0 error(s), 0 warning(s)
80>Compiling...
80>Object_Manager_Test.cpp
81>------ Build started: Project: OS_Test, Configuration: Debug Win32 ------
81>Compiling...
81>OS_Test.cpp
80>Main.cpp
80>Generating Code...
81>Main.cpp
80>Compiling manifest to resources...
80>Linking...
80> Creating library .\\Object_Manager_Test.lib and object .\\Object_Manager_Test.exp
80>Embedding manifest...
81>Generating Code...
81>Compiling manifest to resources...
81>Linking...
80>Build log was saved at "file://c:\\ace\\ACE_wrappers\\tests\\Debug\\Object_Manager_Test_vc8\\BuildLog.htm"
80>Object_Manager_Test - 0 error(s), 0 warning(s)
81>Embedding manifest...
82>------ Build started: Project: Notify_Performance_Test, Configuration: Debug Win32 ------
82>Compiling...
82>Notify_Performance_Test.cpp
81>Build log was saved at "file://c:\\ace\\ACE_wrappers\\tests\\Debug\\OS_Test_vc8\\BuildLog.htm"
81>OS_Test - 0 error(s), 0 warning(s)
83>------ Build started: Project: NonBlocking_Conn_Test, Configuration: Debug Win32 ------
83>Compiling...
83>NonBlocking_Conn_Test.cpp
82>Main.cpp
82>Generating Code...
82>Compiling manifest to resources...
82>Linking...
82> Creating library .\\Notify_Performance_Test.lib and object .\\Notify_Performance_Test.exp
83>Main.cpp
82>Embedding manifest...
83>Generating Code...
82>Build log was saved at "file://c:\\ace\\ACE_wrappers\\tests\\Debug\\Notify_Performance_Test_vc8\\BuildLog.htm"
82>Notify_Performance_Test - 0 error(s), 0 warning(s)
84>------ Build started: Project: New_Fail_Test, Configuration: Debug Win32 ------
83>Compiling manifest to resources...
83>Linking...
84>Compiling...
83> Creating library .\\NonBlocking_Conn_Test.lib and object .\\NonBlocking_Conn_Test.exp
84>New_Fail_Test.cpp
83>Embedding manifest...
83>Build log was saved at "file://c:\\ace\\ACE_wrappers\\tests\\Debug\\NonBlocking_Conn_Test_vc8\\BuildLog.htm"
83>NonBlocking_Conn_Test - 0 error(s), 0 warning(s)
84>Main.cpp
84>Generating Code...
84>Compiling manifest to resources...
84>Linking...
84> Creating library .\\New_Fail_Test.lib and object .\\New_Fail_Test.exp
84>Embedding manifest...
84>Build log was saved at "file://c:\\ace\\ACE_wrappers\\tests\\Debug\\New_Fail_Test_vc8\\BuildLog.htm"
84>New_Fail_Test - 0 error(s), 0 warning(s)
85>------ Build started: Project: Network_Adapters_Test, Configuration: Debug Win32 ------
86>------ Build started: Project: Naming_Test, Configuration: Debug Win32 ------
86>Compiling...
85>Compiling...
86>Naming_Test.cpp
85>Network_Adapters_Test.cpp
85>Main.cpp
85>Generating Code...
86>Main.cpp
86>Generating Code...
86>Compiling manifest to resources...
86>Linking...
85>Compiling manifest to resources...
85>Linking...
86> Creating library .\\Naming_Test.lib and object .\\Naming_Test.exp
85>Embedding manifest...
86>Embedding manifest...
85>Build log was saved at "file://c:\\ace\\ACE_wrappers\\tests\\Debug\\Network_Adapters_Test_vc8\\BuildLog.htm"
85>Network_Adapters_Test - 0 error(s), 0 warning(s)
86>Build log was saved at "file://c:\\ace\\ACE_wrappers\\tests\\Debug\\Naming_Test_vc8\\BuildLog.htm"
86>Naming_Test - 0 error(s), 0 warning(s)
87>------ Build started: Project: Multihomed_INET_Addr_Test, Configuration: Debug Win32 ------
87>Compiling...
87>Multihomed_INET_Addr_Test.cpp
88>------ Build started: Project: Multihomed_INET_Addr_Test_IPV6, Configuration: Debug Win32 ------
88>Compiling...
88>Multihomed_INET_Addr_Test_IPV6.cpp
87>Main.cpp
87>Generating Code...
87>Compiling manifest to resources...
87>Linking...
88>Main.cpp
87>Embedding manifest...
88>Generating Code...
87>Build log was saved at "file://c:\\ace\\ACE_wrappers\\tests\\Debug\\Multihomed_INET_Addr_Test_vc8\\BuildLog.htm"
87>Multihomed_INET_Addr_Test - 0 error(s), 0 warning(s)
88>Compiling manifest to resources...
88>Linking...
88>Embedding manifest...
89>------ Build started: Project: Multicast_Test, Configuration: Debug Win32 ------
89>Compiling...
88>Build log was saved at "file://c:\\ace\\ACE_wrappers\\tests\\Debug\\Multihomed_INET_Addr_Test_IPV6_vc8\\BuildLog.htm"
88>Multihomed_INET_Addr_Test_IPV6 - 0 error(s), 0 warning(s)
89>Multicast_Test.cpp
90>------ Build started: Project: Multicast_Test_IPV6, Configuration: Debug Win32 ------
90>Compiling...
90>Multicast_Test_IPV6.cpp
89>Main.cpp
90>Main.cpp
89>Generating Code...
89>Compiling manifest to resources...
89>Linking...
89> Creating library .\\Multicast_Test.lib and object .\\Multicast_Test.exp
90>Generating Code...
90>Compiling manifest to resources...
90>Linking...
89>Embedding manifest...
90> Creating library .\\Multicast_Test_IPV6.lib and object .\\Multicast_Test_IPV6.exp
90>Embedding manifest...
89>Build log was saved at "file://c:\\ace\\ACE_wrappers\\tests\\Debug\\Multicast_Test_vc8\\BuildLog.htm"
89>Multicast_Test - 0 error(s), 0 warning(s)
91>------ Build started: Project: Message_Queue_Test, Configuration: Debug Win32 ------
90>Build log was saved at "file://c:\\ace\\ACE_wrappers\\tests\\Debug\\Multicast_Test_IPV6_vc8\\BuildLog.htm"
90>Multicast_Test_IPV6 - 0 error(s), 0 warning(s)
91>Compiling...
91>Message_Queue_Test.cpp
92>------ Build started: Project: Message_Queue_Test_Ex, Configuration: Debug Win32 ------
92>Compiling...
92>Message_Queue_Test_Ex.cpp
91>Main.cpp
91>Generating Code...
91>Compiling manifest to resources...
91>Linking...
91> Creating library .\\Message_Queue_Test.lib and object .\\Message_Queue_Test.exp
92>Main.cpp
91>Embedding manifest...
91>Build log was saved at "file://c:\\ace\\ACE_wrappers\\tests\\Debug\\Message_Queue_Test_vc8\\BuildLog.htm"
91>Message_Queue_Test - 0 error(s), 0 warning(s)
92>Generating Code...
93>------ Build started: Project: Message_Queue_Notifications_Test, Configuration: Debug Win32 ------
92>Compiling manifest to resources...
93>Compiling...
93>Message_Queue_Notifications_Test.cpp
93>Main.cpp
93>Generating Code...
92>Linking...
93>Compiling manifest to resources...
93>Linking...
92> Creating library .\\Message_Queue_Test_Ex.lib and object .\\Message_Queue_Test_Ex.exp
93> Creating library .\\Message_Queue_Notifications_Test.lib and object .\\Message_Queue_Notifications_Test.exp
92>Embedding manifest...
93>Embedding manifest...
92>Build log was saved at "file://c:\\ace\\ACE_wrappers\\tests\\Debug\\Message_Queue_Test_Ex_vc8\\BuildLog.htm"
92>Message_Queue_Test_Ex - 0 error(s), 0 warning(s)
93>Build log was saved at "file://c:\\ace\\ACE_wrappers\\tests\\Debug\\Message_Queue_Notifications_Test_vc8\\BuildLog.htm"
93>Message_Queue_Notifications_Test - 0 error(s), 0 warning(s)
94>------ Build started: Project: Message_Block_Test, Configuration: Debug Win32 ------
95>------ Build started: Project: Memcpy_Test, Configuration: Debug Win32 ------
94>Compiling...
95>Compiling...
94>Message_Block_Test.cpp
95>Memcpy_Test.cpp
95>Main.cpp
95>Generating Code...
94>Main.cpp
94>Generating Code...
94>Compiling manifest to resources...
95>Compiling manifest to resources...
95>Linking...
94>Linking...
94> Creating library .\\Message_Block_Test.lib and object .\\Message_Block_Test.exp
94>Embedding manifest...
95>Embedding manifest...
95>Build log was saved at "file://c:\\ace\\ACE_wrappers\\tests\\Debug\\Memcpy_Test_vc8\\BuildLog.htm"
95>Memcpy_Test - 0 error(s), 0 warning(s)
94>Build log was saved at "file://c:\\ace\\ACE_wrappers\\tests\\Debug\\Message_Block_Test_vc8\\BuildLog.htm"
94>Message_Block_Test - 0 error(s), 0 warning(s)
96>------ Build started: Project: Mem_Map_Test, Configuration: Debug Win32 ------
96>Compiling...
96>Mem_Map_Test.cpp
96>Main.cpp
97>------ Build started: Project: Max_Default_Port_Test, Configuration: Debug Win32 ------
97>Compiling...
97>Max_Default_Port_Test.cpp
96>Generating Code...
96>Compiling manifest to resources...
96>Linking...
96> Creating library .\\Mem_Map_Test.lib and object .\\Mem_Map_Test.exp
96>Embedding manifest...
96>Build log was saved at "file://c:\\ace\\ACE_wrappers\\tests\\Debug\\Mem_Map_Test_vc8\\BuildLog.htm"
96>Mem_Map_Test - 0 error(s), 0 warning(s)
97>Main.cpp
97>Generating Code...
97>Compiling manifest to resources...
97>Linking...
98>------ Build started: Project: Max_Default_Port_Test_IPV6, Configuration: Debug Win32 ------
98>Compiling...
97>Embedding manifest...
98>Max_Default_Port_Test_IPV6.cpp
97>Build log was saved at "file://c:\\ace\\ACE_wrappers\\tests\\Debug\\Max_Default_Port_Test_vc8\\BuildLog.htm"
97>Max_Default_Port_Test - 0 error(s), 0 warning(s)
99>------ Build started: Project: Map_Test, Configuration: Debug Win32 ------
99>Compiling...
98>Main.cpp
99>Map_Test.cpp
98>Generating Code...
98>Compiling manifest to resources...
98>Linking...
98>Embedding manifest...
98>Build log was saved at "file://c:\\ace\\ACE_wrappers\\tests\\Debug\\Max_Default_Port_Test_IPV6_vc8\\BuildLog.htm"
98>Max_Default_Port_Test_IPV6 - 0 error(s), 0 warning(s)
99>Main.cpp
99>Generating Code...
100>------ Build started: Project: Map_Manager_Test, Configuration: Debug Win32 ------
99>Compiling manifest to resources...
99>Linking...
100>Compiling...
99> Creating library .\\Map_Test.lib and object .\\Map_Test.exp
100>Map_Manager_Test.cpp
99>Embedding manifest...
99>Build log was saved at "file://c:\\ace\\ACE_wrappers\\tests\\Debug\\Map_Test_vc8\\BuildLog.htm"
99>Map_Test - 0 error(s), 0 warning(s)
100>Main.cpp
101>------ Build started: Project: Manual_Event_Test, Configuration: Debug Win32 ------
101>Compiling...
101>Manual_Event_Test.cpp
100>Generating Code...
100>Compiling manifest to resources...
100>Linking...
100> Creating library .\\Map_Manager_Test.lib and object .\\Map_Manager_Test.exp
100>Embedding manifest...
101>Main.cpp
100>Build log was saved at "file://c:\\ace\\ACE_wrappers\\tests\\Debug\\Map_Manager_Test_vc8\\BuildLog.htm"
100>Map_Manager_Test - 0 error(s), 0 warning(s)
101>Generating Code...
101&

calsmurf2904
Posts: 15
Joined: Sat Oct 28, 2006 6:34 pm

Post by calsmurf2904 » Fri Nov 03, 2006 5:46 pm

okay now i got the ace lib files but i get this error when i try to compile cohemu :
[list:63557d2672]1>------ Build started: Project: ZERO_CHECK, Configuration: Debug Win32 ------
1>Performing Post-Build Event...
1>"Checking build system"
1>Build log was saved at "file://c:\\COHEMU WIN32\\ZERO_CHECK.dir\\Debug\\BuildLog.htm"
1>ZERO_CHECK - 0 error(s), 0 warning(s)
2>------ Build started: Project: cohemu_common, Configuration: Debug Win32 ------
3>------ Build started: Project: authserver_lib, Configuration: Debug Win32 ------
3>Compiling...
2>Compiling...
3>AuthServer.cpp
2>AuthServerInterface.cpp
3>C:\\COHEMU\\Common\\include\\Config.h(61) : warning C4018: '>=' : signed/unsigned mismatch
2>C:\\COHEMU\\AuthServer/include/AuthServer.h(30) : fatal error C1083: Cannot open include file: 'boost/pool/object_pool.hpp': No such file or directory
2>Build log was saved at "file://c:\\COHEMU WIN32\\Common\\src\\cohemu_common.dir\\Debug\\BuildLog.htm"
2>cohemu_common - 1 error(s), 0 warning(s)
3>c:\\cohemu\\authserver\\src\\AuthServer.h(30) : fatal error C1083: Cannot open include file: 'boost/pool/object_pool.hpp': No such file or directory
3>AuthFSM.cpp
3>c:\\cohemu\\authserver\\src\\AuthServer.h(30) : fatal error C1083: Cannot open include file: 'boost/pool/object_pool.hpp': No such file or directory
3>Generating Code...
3>Build log was saved at "file://c:\\COHEMU WIN32\\AuthServer\\src\\authserver_lib.dir\\Debug\\BuildLog.htm"
3>authserver_lib - 2 error(s), 1 warning(s)
4>------ Build started: Project: authserver, Configuration: Debug Win32 ------
4>Linking...
4>LINK : fatal error LNK1104: cannot open file 'cohemu_common.lib'
4>Build log was saved at "file://c:\\COHEMU WIN32\\AuthServer\\src\\authserver.dir\\Debug\\BuildLog.htm"
4>authserver - 1 error(s), 0 warning(s)
5>------ Skipped Build: Project: ALL_BUILD, Configuration: Debug Win32 ------
5>Project not selected to build for this solution configuration
6>------ Skipped Build: Project: INSTALL, Configuration: Debug Win32 ------
6>Project not selected to build for this solution configuration
========== Build: 1 succeeded, 3 failed, 3 up-to-date, 2 skipped ==========[/list:u:63557d2672]

It gave a few errors when i compile ace maybe it is the fault ? :
[list:63557d2672]1>------ Build started: Project: ACE, Configuration: Debug Win32 ------
2>------ Build started: Project: Library_Unload, Configuration: Debug Win32 ------
2>Compiling...
2>Unload_libACE.cpp
2>Compiling manifest to resources...
1>Compiling...
2>Linking...
1>XTI_ATM_Mcast.cpp
2>Embedding manifest...
2>Build log was saved at "file://c:\\ace\\ACE_wrappers\\tests\\Debug\\Library_Unload_vc8\\BuildLog.htm"
2>Library_Unload - 0 error(s), 0 warning(s)
1>XML_Svc_Conf.cpp
1>WIN32_Proactor.cpp
1>WIN32_Asynch_IO.cpp
1>WFMO_Reactor.cpp
1>UUID.cpp
1>UTF8_Encoding_Converter.cpp
1>UTF32_Encoding_Converter.cpp
1>UTF16_Encoding_Converter.cpp
1>UPIPE_Stream.cpp
1>UPIPE_Connector.cpp
1>UPIPE_Acceptor.cpp
1>UNIX_Addr.cpp
1>TTY_IO.cpp
1>TSS_Adapter.cpp
1>Trace.cpp
1>TP_Reactor.cpp
1>Token_Request_Reply.cpp
1>Token_Manager.cpp
1>Token_Invariants.cpp
1>Generating Code...
1>Compiling...
1>Token_Collection.cpp
1>Token.cpp
1>TLI_Stream.cpp
1>TLI_Connector.cpp
1>TLI_Acceptor.cpp
1>TLI.cpp
1>Timer_Wheel.cpp
1>Timer_Queue.cpp
1>Timer_List.cpp
1>Timer_Heap.cpp
1>Timer_Hash.cpp
1>Timeprobe.cpp
1>Time_Value.cpp
1>Time_Request_Reply.cpp
1>.\\Time_Request_Reply.cpp(39) : warning C4244: '=' : conversion from 'time_t' to 'ACE_UINT32', possible loss of data
1>.\\Time_Request_Reply.cpp(105) : warning C4244: '=' : conversion from 'time_t' to 'ACE_UINT32', possible loss of data
1>Thread_Semaphore.cpp
1>Thread_Mutex.cpp
1>Thread_Manager.cpp
1>Thread_Hook.cpp
1>Thread_Exit.cpp
1>Thread_Control.cpp
1>Generating Code...
1>Compiling...
1>Thread_Adapter.cpp
1>Thread.cpp
1>Task.cpp
1>System_Time.cpp
1>.\\System_Time.cpp(62) : warning C4244: '=' : conversion from 'time_t' to 'ACE_UINT32', possible loss of data
1>Synch_Options.cpp
1>Svc_Conf_y.cpp
1>Svc_Conf_Lexer.cpp
1>.\\Svc_Conf_Lexer.cpp(66) : warning C4351: new behavior: elements of array 'ace_yy_buffer_state::input_' will be default initialized
1>SV_Shared_Memory.cpp
1>SV_Semaphore_Simple.cpp
1>SV_Semaphore_Complex.cpp
1>SV_Message_Queue.cpp
1>SV_Message.cpp
1>SUN_Proactor.cpp
1>String_Base_Const.cpp
1>Stats.cpp
1>SString.cpp
1>SPIPE_Stream.cpp
1>SPIPE_Connector.cpp
1>SPIPE_Addr.cpp
1>SPIPE_Acceptor.cpp
1>Generating Code...
1>Compiling...
1>SPIPE.cpp
1>SOCK_Stream.cpp
1>SOCK_SEQPACK_Connector.cpp
1>SOCK_SEQPACK_Association.cpp
1>SOCK_SEQPACK_Acceptor.cpp
1>SOCK_Netlink.cpp
1>SOCK_IO.cpp
1>SOCK_Dgram_Mcast.cpp
1>SOCK_Dgram_Bcast.cpp
1>SOCK_Dgram.cpp
1>SOCK_Connector.cpp
1>Sock_Connect.cpp
1>SOCK_CODgram.cpp
1>SOCK_Acceptor.cpp
1>SOCK.cpp
1>Signal.cpp
1>Sig_Handler.cpp
1>Sig_Adapter.cpp
1>Shared_Object.cpp
1>Shared_Memory_SV.cpp
1>Generating Code...
1>Compiling...
1>Shared_Memory_Pool.cpp
1>Shared_Memory_MM.cpp
1>Shared_Memory.cpp
1>Service_Types.cpp
1>Service_Repository.cpp
1>Service_Object.cpp
1>Service_Manager.cpp
1>Service_Gestalt.cpp
1>Service_Config.cpp
1>Semaphore.cpp
1>Select_Reactor_Base.cpp
1>Sched_Params.cpp
1>Sbrk_Memory_Pool.cpp
1>Sample_History.cpp
1>RW_Thread_Mutex.cpp
1>RW_Process_Mutex.cpp
1>RW_Mutex.cpp
1>Remote_Tokens.cpp
1>Remote_Name_Space.cpp
1>Registry_Name_Space.cpp
1>Generating Code...
1>Compiling...
1>Registry.cpp
1>Refcountable.cpp
1>Recyclable.cpp
1>Recursive_Thread_Mutex.cpp
1>Read_Buffer.cpp
1>Reactor_Timer_Interface.cpp
1>Reactor_Notification_Strategy.cpp
1>Reactor_Impl.cpp
1>Reactor.cpp
1>Profile_Timer.cpp
1>Process_Semaphore.cpp
1>Process_Mutex.cpp
1>Process_Manager.cpp
1>Process.cpp
1>Proactor_Impl.cpp
1>Proactor.cpp
1>Priority_Reactor.cpp
1>POSIX_Proactor.cpp
1>POSIX_CB_Proactor.cpp
1>POSIX_Asynch_IO.cpp
1>Generating Code...
1>Compiling...
1>Pipe.cpp
1>Ping_Socket.cpp
1>PI_Malloc.cpp
1>Parse_Node.cpp
1>Pagefile_Memory_Pool.cpp
1>OS_TLI.cpp
1>OS_Thread_Adapter.cpp
1>OS_QoS.cpp
1>OS_NS_wchar.cpp
1>OS_NS_unistd.cpp
1>OS_NS_time.cpp
1>OS_NS_Thread.cpp
1>OS_NS_sys_wait.cpp
1>OS_NS_sys_utsname.cpp
1>OS_NS_sys_uio.cpp
1>OS_NS_sys_time.cpp
1>OS_NS_sys_stat.cpp
1>OS_NS_sys_socket.cpp
1>OS_NS_sys_shm.cpp
1>OS_NS_sys_sendfile.cpp
1>Generating Code...
1>Compiling...
1>OS_NS_sys_select.cpp
1>OS_NS_sys_resource.cpp
1>OS_NS_sys_msg.cpp
1>OS_NS_sys_mman.cpp
1>OS_NS_stropts.cpp
1>OS_NS_strings.cpp
1>OS_NS_string.cpp
1>OS_NS_stdlib.cpp
1>OS_NS_stdio.cpp
1>OS_NS_signal.cpp
1>OS_NS_regex.cpp
1>OS_NS_pwd.cpp
1>OS_NS_poll.cpp
1>OS_NS_netdb.cpp
1>OS_NS_math.cpp
1>OS_NS_fcntl.cpp
1>OS_NS_errno.cpp
1>OS_NS_dlfcn.cpp
1>OS_NS_dirent.cpp
1>OS_NS_ctype.cpp
1>Generating Code...
1>Compiling...
1>OS_NS_arpa_inet.cpp
1>OS_main.cpp
1>OS_Log_Msg_Attributes.cpp
1>OS_Errno.cpp
1>Object_Manager_Base.cpp
1>Object_Manager.cpp
1>Obchunk.cpp
1>NT_Service.cpp
1>Notification_Strategy.cpp
1>Netlink_Addr.cpp
1>Naming_Context.cpp
1>Name_Space.cpp
1>Name_Request_Reply.cpp
1>.\\Name_Request_Reply.cpp(49) : warning C4244: '=' : conversion from 'time_t' to 'ACE_UINT32', possible loss of data
1>.\\Name_Request_Reply.cpp(196) : warning C4244: '=' : conversion from 'time_t' to 'ACE_UINT32', possible loss of data
1>Name_Proxy.cpp
1>Mutex.cpp
1>Multihomed_INET_Addr.cpp
1>Msg_WFMO_Reactor.cpp
1>MMAP_Memory_Pool.cpp
1>.\\MMAP_Memory_Pool.cpp(261) : warning C4244: 'argument' : conversion from 'ACE_LOFF_T' to 'ssize_t', possible loss of data
1>.\\MMAP_Memory_Pool.cpp(286) : warning C4244: 'argument' : conversion from 'ACE_LOFF_T' to 'size_t', possible loss of data
1>.\\MMAP_Memory_Pool.cpp(400) : warning C4244: 'initializing' : conversion from 'ACE_LOFF_T' to 'const off_t', possible loss of data
1>Method_Request.cpp
1>Message_Queue.cpp
1>Generating Code...
1>Compiling...
1>Message_Block.cpp
1>c:\\ace\\ACE_wrappers\\ace/Message_Block.inl(620) : warning C4244: 'argument' : conversion from 'time_t' to 'unsigned long', possible loss of data
1>MEM_Stream.cpp
1>MEM_SAP.cpp
1>Mem_Map.cpp
1>MEM_IO.cpp
1>MEM_Connector.cpp
1>MEM_Addr.cpp
1>MEM_Acceptor.cpp
1>Manual_Event.cpp
1>Malloc_Allocator.cpp
1>Malloc.cpp
1>LSOCK_Stream.cpp
1>LSOCK_Dgram.cpp
1>LSOCK_Connector.cpp
1>LSOCK_CODgram.cpp
1>LSOCK_Acceptor.cpp
1>LSOCK.cpp
1>Logging_Strategy.cpp
1>Log_Record.cpp
1>c:\\ace\\ACE_wrappers\\ace/Log_Record.inl(39) : warning C4244: '=' : conversion from 'time_t' to 'ACE_UINT32', possible loss of data
1>Log_Msg_UNIX_Syslog.cpp
1>Generating Code...
1>Compiling...
1>Log_Msg_NT_Event_Log.cpp
1>Log_Msg_IPC.cpp
1>Log_Msg_Callback.cpp
1>Log_Msg_Backend.cpp
1>Log_Msg.cpp
1>Lock.cpp
1>Local_Tokens.cpp
1>Local_Name_Space.cpp
1>Local_Memory_Pool.cpp
1>Lib_Find.cpp
1>IPC_SAP.cpp
1>IOStream.cpp
1>IO_SAP.cpp
1>IO_Cntl_Msg.cpp
1>Init_ACE.cpp
1>INET_Addr.cpp
1>ICMP_Socket.cpp
1>High_Res_Timer.cpp
1>Hashable.cpp
1>Handle_Set.cpp
1>Generating Code...
1>Compiling...
1>Handle_Ops.cpp
1>gethrtime.cpp
1>Get_Opt.cpp
1>Functor_String.cpp
1>Functor.cpp
1>Framework_Component.cpp
1>Flag_Manip.cpp
1>Filecache.cpp
1>.\\Filecache.cpp(603) : warning C4244: 'argument' : conversion from 'ACE_LOFF_T' to 'ssize_t', possible loss of data
1>File_Lock.cpp
1>FILE_IO.cpp
1>FILE_Connector.cpp
1>FILE_Addr.cpp
1>FILE.cpp
1>FIFO_Send_Msg.cpp
1>FIFO_Send.cpp
1>FIFO_Recv_Msg.cpp
1>FIFO_Recv.cpp
1>FIFO.cpp
1>Event_Handler.cpp
1>Event.cpp
1>Generating Code...
1>Compiling...
1>Encoding_Converter_Factory.cpp
1>Encoding_Converter.cpp
1>Dynamic_Service_Dependency.cpp
1>Dynamic_Service_Base.cpp
1>Dynamic.cpp
1>Dump.cpp
1>DLL_Manager.cpp
1>DLL.cpp
1>Dirent_Selector.cpp
1>Dirent.cpp
1>Dev_Poll_Reactor.cpp
1>DEV_IO.cpp
1>DEV_Connector.cpp
1>DEV_Addr.cpp
1>DEV.cpp
1>Date_Time.cpp
1>Countdown_Time.cpp
1>Copy_Disabled.cpp
1>Containers.cpp
1>Connection_Recycling_Strategy.cpp
1>Generating Code...
1>Compiling...
1>Configuration_Import_Export.cpp
1>Configuration.cpp
1>Condition_Thread_Mutex.cpp
1>Condition_Recursive_Thread_Mutex.cpp
1>Codeset_Registry_db.cpp
1>Codeset_Registry.cpp
1>Codeset_IBM1047.cpp
1>Codecs.cpp
1>Cleanup.cpp
1>CDR_Stream.cpp
1>CDR_Size.cpp
1>CDR_Base.cpp
1>Capabilities.cpp
1>Basic_Types.cpp
1>Basic_Stats.cpp
1>Based_Pointer_Repository.cpp
1>Base_Thread_Adapter.cpp
1>Barrier.cpp
1>Auto_Event.cpp
1>Atomic_Op.cpp
1>Generating Code...
1>Compiling...
1>ATM_Stream.cpp
1>ATM_QoS.cpp
1>ATM_Params.cpp
1>ATM_Connector.cpp
1>ATM_Addr.cpp
1>ATM_Acceptor.cpp
1>Asynch_Pseudo_Task.cpp
1>Asynch_IO_Impl.cpp
1>Asynch_IO.cpp
1>Assert.cpp
1>Argv_Type_Converter.cpp
1>Addr.cpp
1>Active_Map_Manager.cpp
1>Activation_Queue.cpp
1>ACE_crc_ccitt.cpp
1>ACE_crc32.cpp
1>ACE.cpp
1>Generating Code...
1>Compiling...
1>Atomic_Op_Sparc.c
1>Compiling resources...
1>Compiling manifest to resources...
1>Linking...
1> Creating library ..\\lib\\ACEd.lib and object ..\\lib\\ACEd.exp
1>Embedding manifest...
1>Build log was saved at "file://c:\\ace\\ACE_wrappers\\ace\\Debug\\ACE_vc8\\BuildLog.htm"
1>ACE - 0 error(s), 12 warning(s)
3>------ Build started: Project: ASX_CCM_App_Lib, Configuration: Debug Win32 ------
4>------ Build started: Project: gperf, Configuration: Debug Win32 ------
3>Compiling...
4>Compiling...
3>CCM_App.cpp
4>Version.cpp
4>Vectors.cpp
4>Options.cpp
3>Compiling manifest to resources...
3>Linking...
3> Creating library ..\\..\\..\\lib\\ccm_appd.lib and object ..\\..\\..\\lib\\ccm_appd.exp
4>List_Node.cpp
3>Embedding manifest...
3>Build log was saved at "file://c:\\ace\\ACE_wrappers\\examples\\ASX\\CCM_App\\Debug\\ASX_CCM_App_Lib_vc8\\BuildLog.htm"
3>ASX_CCM_App_Lib - 0 error(s), 0 warning(s)
4>Key_List.cpp
5>------ Build started: Project: DLL_Test_Parent_Lib, Configuration: Debug Win32 ------
5>Compiling...
5>DLL_Test_Parent.cpp
4>Iterator.cpp
5>Compiling manifest to resources...
5>Linking...
5> Creating library ..\\lib\\DLL_Test_Parentd.lib and object ..\\lib\\DLL_Test_Parentd.exp
4>Hash_Table.cpp
5>Embedding manifest...
5>Build log was saved at "file://c:\\ace\\ACE_wrappers\\tests\\Debug\\DLL_Test_Parent_Lib_vc8\\BuildLog.htm"
5>DLL_Test_Parent_Lib - 0 error(s), 0 warning(s)
4>gperf.cpp
4>Gen_Perf.cpp
4>.\\Gen_Perf.cpp(254) : warning C4244: 'argument' : conversion from 'time_t' to 'u_int', possible loss of data
4>Bool_Array.cpp
6>------ Build started: Project: ACEXML, Configuration: Debug Win32 ------
6>Compiling...
6>ZipCharStream.cpp
6>XMLReader.cpp
4>Generating Code...
4>Compiling manifest to resources...
4>Linking...
4> Creating library ..\\..\\..\\bin\\gperf.lib and object ..\\..\\..\\bin\\gperf.exp
4>Embedding manifest...
6>XMLFilterImpl.cpp
4>Build log was saved at "file://c:\\ace\\ACE_wrappers\\apps\\gperf\\src\\Debug\\gperf_vc8\\BuildLog.htm"
4>gperf - 0 error(s), 1 warning(s)
7>------ Build started: Project: QoS, Configuration: Debug Win32 ------
7>Compiling...
7>SOCK_Dgram_Mcast_QoS.cpp
6>XML_Util.cpp
7>QoS_Session_Impl.cpp
6>XML_Codecs.cpp
7>QoS_Session_Factory.cpp
6>Validator.cpp
7>QoS_Manager.cpp
6>URL_Addr.cpp
7>QoS_Decorator.cpp
6>Transcode.cpp
7>Generating Code...
7>Compiling manifest to resources...
7>Linking...
6>StreamFactory.cpp
7> Creating library ..\\..\\lib\\ACE_QoSd.lib and object ..\\..\\lib\\ACE_QoSd.exp
7>Embedding manifest...
7>Build log was saved at "file://c:\\ace\\ACE_wrappers\\ace\\QoS\\Debug\\QoS_vc8\\BuildLog.htm"
7>QoS - 0 error(s), 0 warning(s)
8>------ Build started: Project: Gateway, Configuration: Debug Win32 ------
8>Compiling...
8>Options.cpp
6>StrCharStream.cpp
8>Gateway.cpp
6>SAXExceptions.cpp
6>NamespaceSupport.cpp
8>File_Parser.cpp
6>Mem_Map_Stream.cpp
8>Event_Forwarding_Discriminator.cpp
8>Event_Channel.cpp
6>LocatorImpl.cpp
6>Locator.cpp
8>Connection_Handler_Connector.cpp
6>InputSource.cpp
6>HttpCharStream.cpp
8>Connection_Handler_Acceptor.cpp
6>FileCharStream.cpp
8>Connection_Handler.cpp
6>.\\FileCharStream.cpp(40) : warning C4244: '=' : conversion from '__int64' to 'off_t', possible loss of data
6>Exception.cpp
6>ErrorHandler.cpp
8>Config_Files.cpp
6>Generating Code...
6>Compiling...
6>Env.cpp
8>Concrete_Connection_Handlers.cpp
6>EntityResolver.cpp
6>Encoding.cpp
8>Generating Code...
6>Element_Def_Builder.cpp
8>Compiling manifest to resources...
8>Linking...
8> Creating library ..\\..\\..\\lib\\Gatewayd.lib and object ..\\..\\..\\lib\\Gatewayd.exp
8>Embedding manifest...
6>DTDHandler.cpp
8>Build log was saved at "file://c:\\ace\\ACE_wrappers\\apps\\Gateway\\Gateway\\Debug\\Gateway_vc8\\BuildLog.htm"
8>Gateway - 0 error(s), 0 warning(s)
6>DTD_Manager.cpp
9>------ Build started: Project: Gateway_Peer, Configuration: Debug Win32 ------
9>Compiling...
9>Peer.cpp
6>DefaultHandler.cpp
6>ContentHandler.cpp
9>Options.cpp
6>CharStream.cpp
9>Generating Code...
9>Compiling manifest to resources...
9>Linking...
6>AttributesImpl.cpp
9> Creating library ..\\..\\..\\lib\\Gateway_Peerd.lib and object ..\\..\\..\\lib\\Gateway_Peerd.exp
9>Embedding manifest...
9>Build log was saved at "file://c:\\ace\\ACE_wrappers\\apps\\Gateway\\Peer\\Debug\\Gateway_Peer_vc8\\BuildLog.htm"
9>Gateway_Peer - 0 error(s), 0 warning(s)
10>------ Build started: Project: JAWS, Configuration: Debug Win32 ------
6>Attributes_Def_Builder.cpp
10>Compiling...
10>Parse_Headers.cpp
10>JAWS_Pipeline.cpp
6>Attributes.cpp
6>Generating Code...
6>Compiling manifest to resources...
6>Linking...
6> Creating library ..\\..\\lib\\ACEXMLd.lib and object ..\\..\\lib\\ACEXMLd.exp
10>JAWS_Concurrency.cpp
6>Embedding manifest...
6>Build log was saved at "file://c:\\ace\\ACE_wrappers\\ACEXML\\common\\Debug\\ACEXML_vc8\\BuildLog.htm"
6>ACEXML - 0 error(s), 1 warning(s)
10>IO.cpp
11>------ Build started: Project: JAWS3, Configuration: Debug Win32 ------
11>Compiling...
11>TPR_Concurrency.cpp
10>.\\IO.cpp(131) : warning C4244: 'argument' : conversion from 'ACE_LOFF_T' to 'size_t', possible loss of data
10>.\\IO.cpp(513) : warning C4244: 'initializing' : conversion from '__int64' to 'ssize_t', possible loss of data
10>HTTP_Server.cpp
11>TPOOL_Concurrency.cpp
10>HTTP_Response.cpp
11>Timer_Helpers.cpp
10>HTTP_Request.cpp
10>HTTP_Helpers.cpp
11>Timer.cpp
10>HTTP_Handler.cpp
11>THYBRID_Concurrency.cpp
10>HTTP_Config.cpp
10>Generating Code...
10>Compiling manifest to resources...
10>Linking...
10> Creating library ..\\..\\..\\lib\\JAWSd.lib and object ..\\..\\..\\lib\\JAWSd.exp
10>Embedding manifest...
11>Templates.cpp
10>Build log was saved at "file://c:\\ace\\ACE_wrappers\\apps\\JAWS\\server\\Debug\\JAWS_vc8\\BuildLog.htm"
10>JAWS - 0 error(s), 2 warning(s)
12>------ Build started: Project: Kokyu, Configuration: Debug Win32 ------
12>Compiling...
12>Kokyu_defs.cpp
12>Kokyu.cpp
11>Task_Timer.cpp
12>Dispatcher_Task.cpp
11>Synch_IO.cpp
11>Symbol_Table.cpp
12>Dispatcher_Impl.cpp
11>Signal_Task.cpp
12>Default_Dispatcher_Impl.cpp
11>Reactive_IO.cpp
12>Generating Code...
12>Compiling manifest to resources...
12>Linking...
12> Creating library ..\\lib\\Kokyud.lib and object ..\\lib\\Kokyud.exp
12>Embedding manifest...
11>Protocol_Handler.cpp
12>Build log was saved at "file://c:\\ace\\ACE_wrappers\\Kokyu\\Debug\\Kokyu_vc8\\BuildLog.htm"
12>Kokyu - 0 error(s), 0 warning(s)
13>------ Build started: Project: iinset, Configuration: Debug Win32 ------
13>Invoking ..\\..\\..\\bin\\gperf on idl.gperf
13>Compiling...
11>Options.cpp
13>test.cpp
13>idl.cpp
13>Generating Code...
13>Compiling manifest to resources...
13>Linking...
11>IO.cpp
13>Embedding manifest...
13>Build log was saved at "file://c:\\ace\\ACE_wrappers\\apps\\gperf\\tests\\Debug\\iinset_vc8\\BuildLog.htm"
13>iinset - 0 error(s), 0 warning(s)
11>FILE.cpp
14>------ Build started: Project: asnmp_lib, Configuration: Debug Win32 ------
14>Compiling...
14>wpdu.cpp
11>Event_Dispatcher.cpp
14>vb.cpp
14>transaction.cpp
11>Event_Completer.cpp
11>Datagram.cpp
14>timetick.cpp
14>target.cpp
11>Config_File.cpp
14>snmp.cpp
11>Concurrency.cpp
14>sagent.cpp
14>pdu.cpp
11>Generating Code...
14>oid.cpp
11>Compiling...
11>Asynch_IO.cpp
14>octet.cpp
11>Generating Code...
14>integer.cpp
11>Compiling manifest to resources...
11>Linking...
11> Creating library ..\\..\\..\\lib\\JAWS3d.lib and object ..\\..\\..\\lib\\JAWS3d.exp
14>gauge.cpp
11>Embedding manifest...
14>ctr64.cpp
14>counter.cpp
11>Build log was saved at "file://c:\\ace\\ACE_wrappers\\apps\\JAWS3\\jaws3\\Debug\\JAWS3_vc8\\BuildLog.htm"
11>JAWS3 - 0 error(s), 0 warning(s)
14>asn1.cpp
15>------ Build started: Project: ASX_CCM_App_Server, Configuration: Debug Win32 ------
15>Compiling...
14>address.cpp
15>SC_Server.cpp
14>Generating Code...
15>Compiling manifest to resources...
15>Linking...
14>Compiling manifest to resources...
14>Linking...
14> Creating library ..\\..\\lib\\asnmpd.lib and object ..\\..\\lib\\asnmpd.exp
15>Embedding manifest...
14>Embedding manifest...
15>Build log was saved at "file://c:\\ace\\ACE_wrappers\\examples\\ASX\\CCM_App\\Debug\\ASX_CCM_App_Server_vc8\\BuildLog.htm"
15>ASX_CCM_App_Server - 0 error(s), 0 warning(s)
16>------ Build started: Project: DLL_Newsweek, Configuration: Debug Win32 ------
14>Build log was saved at "file://c:\\ace\\ACE_wrappers\\ASNMP\\asnmp\\Debug\\asnmp_lib_vc8\\BuildLog.htm"
14>asnmp_lib - 0 error(s), 0 warning(s)
16>Compiling...
16>Newsweek.cpp
17>------ Build started: Project: DLL_Today, Configuration: Debug Win32 ------
16>Compiling manifest to resources...
17>Compiling...
17>Today.cpp
16>Linking...
17>Compiling manifest to resources...
17>Linking...
16> Creating library ..\\..\\lib\\DLL_Newsweekd.lib and object ..\\..\\lib\\DLL_Newsweekd.exp
17> Creating library ..\\..\\lib\\DLL_Todayd.lib and object ..\\..\\lib\\DLL_Todayd.exp
16>Embedding manifest...
17>Embedding manifest...
16>Build log was saved at "file://c:\\ace\\ACE_wrappers\\examples\\DLL\\Debug\\DLL_Newsweek_vc8\\BuildLog.htm"
16>DLL_Newsweek - 0 error(s), 0 warning(s)
17>Build log was saved at "file://c:\\ace\\ACE_wrappers\\examples\\DLL\\Debug\\DLL_Today_vc8\\BuildLog.htm"
17>DLL_Today - 0 error(s), 0 warning(s)
18>------ Build started: Project: websvcs, Configuration: Debug Win32 ------
18>Compiling...
18>URL_Addr.cpp
19>------ Build started: Project: ACEXML_Parser, Configuration: Debug Win32 ------
18>Compiling manifest to resources...
18>Linking...
19>Compiling...
18> Creating library ..\\..\\lib\\websvcsd.lib and object ..\\..\\lib\\websvcsd.exp
19>ParserInternals.cpp
18>Embedding manifest...
18>Build log was saved at "file://c:\\ace\\ACE_wrappers\\websvcs\\lib\\Debug\\websvcs_vc8\\BuildLog.htm"
18>websvcs - 0 error(s), 0 warning(s)
20>------ Build started: Project: Svc_Cfg_IPC_Server_Lib, Configuration: Debug Win32 ------
19>ParserContext.cpp
20>Compiling...
20>Handle_Timeout.cpp
19>Parser.cpp
20>Handle_Thr_Stream.cpp
19>Entity_Manager.cpp
20>Handle_R_Stream.cpp
19>Generating Code...
19>Compiling manifest to resources...
19>Linking...
19> Creating library ..\\..\\..\\lib\\ACEXML_Parserd.lib and object ..\\..\\..\\lib\\ACEXML_Parserd.exp
19>Embedding manifest...
19>Build log was saved at "file://c:\\ace\\ACE_wrappers\\ACEXML\\parser\\parser\\Debug\\ACEXML_Parser_vc8\\BuildLog.htm"
19>ACEXML_Parser - 0 error(s), 0 warning(s)
20>Handle_L_Stream.cpp
21>------ Build started: Project: Service_Configurator_Misc_Timer, Configuration: Debug Win32 ------
21>Compiling...
21>Timer_Service.cpp
20>Handle_L_SPIPE.cpp
21>Compiling manifest to resources...
21>Linking...
20>Handle_L_Pipe.cpp
21> Creating library ..\\..\\..\\lib\\timerd.lib and object ..\\..\\..\\lib\\timerd.exp
21>Embedding manifest...
21>Build log was saved at "file://c:\\ace\\ACE_wrappers\\examples\\Service_Configurator\\Misc\\Debug\\Service_Configurator_Misc_Timer_vc8\\BuildLog.htm"
21>Service_Configurator_Misc_Timer - 0 error(s), 0 warning(s)
20>Handle_L_FIFO.cpp
22>------ Build started: Project: Timer_Queue_Library, Configuration: Debug Win32 ------
22>Compiling...
22>Thread_Timer_Queue_Test.cpp
20>Handle_L_Dgram.cpp
20>Handle_L_CODgram.cpp
22>Reactor_Timer_Queue_Test.cpp
20>Handle_Broadcast.cpp
22>Driver.cpp
20>Generating Code...
20>Compiling manifest to resources...
20>Linking...
20> Creating library ..\\..\\..\\..\\lib\\IPC_Tests_Serverd.lib and object ..\\..\\..\\..\\lib\\IPC_Tests_Serverd.exp
20>Embedding manifest...
22>Async_Timer_Queue_Test.cpp
20>Build log was saved at "file://c:\\ace\\ACE_wrappers\\examples\\Service_Configurator\\IPC-tests\\server\\Debug\\Svc_Cfg_IPC_Server_Lib_vc8\\BuildLog.htm"
20>Svc_Cfg_IPC_Server_Lib - 0 error(s), 0 warning(s)
23>------ Build started: Project: Test_Output, Configuration: Debug Win32 ------
23>Compiling...
23>Test_Output.cpp
22>Generating Code...
22>Compiling manifest to resources...
22>Linking...
22> Creating library ..\\..\\lib\\tqtdd.lib and object ..\\..\\lib\\tqtdd.exp
22>Embedding manifest...
23>Compiling manifest to resources...
23>Linking...
23> Creating library ..\\lib\\Test_Outputd.lib and object ..\\lib\\Test_Outputd.exp
23>Embedding manifest...
22>Build log was saved at "file://c:\\ace\\ACE_wrappers\\examples\\Timer_Queue\\Debug\\Timer_Queue_Library_vc8\\BuildLog.htm"
22>Timer_Queue_Library - 0 error(s), 0 warning(s)
23>Build log was saved at "file://c:\\ace\\ACE_wrappers\\tests\\Debug\\Test_Output_vc8\\BuildLog.htm"
23>Test_Output - 0 error(s), 0 warning(s)
24>------ Build started: Project: Netsvsc_Client_Test_Lib, Configuration: Debug Win32 ------
24>Compiling...
24>Client_Test.cpp
25>------ Build started: Project: Netsvcs_Dump_Restore_Lib, Configuration: Debug Win32 ------
25>Compiling...
25>Dump_Restore.cpp
24>Compiling manifest to resources...
24>Linking...
24> Creating library ..\\..\\..\\..\\lib\\Client_Testd.lib and object ..\\..\\..\\..\\lib\\Client_Testd.exp
24>Embedding manifest...
24>Build log was saved at "file://c:\\ace\\ACE_wrappers\\netsvcs\\clients\\Naming\\Client\\Debug\\Netsvsc_Client_Test_Lib_vc8\\BuildLog.htm"
24>Netsvsc_Client_Test_Lib - 0 error(s), 0 warning(s)
26>------ Build started: Project: netsvcs, Configuration: Debug Win32 ------
26>Compiling...
26>TS_Server_Handler.cpp
25>Compiling manifest to resources...
25>Linking...
25> Creating library ..\\..\\..\\..\\lib\\Dump_Restored.lib and object ..\\..\\..\\..\\lib\\Dump_Restored.exp
25>Embedding manifest...
25>Build log was saved at "file://c:\\ace\\ACE_wrappers\\netsvcs\\clients\\Naming\\Dump_Restore\\Debug\\Netsvcs_Dump_Restore_Lib_vc8\\BuildLog.htm"
25>Netsvcs_Dump_Restore_Lib - 0 error(s), 0 warning(s)
26>.\\TS_Server_Handler.cpp(190) : warning C4244: 'argument' : conversion from 'time_t' to 'const ACE_UINT32', possible loss of data
27>------ Build started: Project: Synch_Lib, Configuration: Debug Win32 ------
27>Compiling...
26>TS_Clerk_Handler.cpp
27>Benchmark_Base.cpp
27>Compiling manifest to resources...
27>Linking...
27> Creating library ..\\..\\..\\lib\\Synch_Libd.lib and object ..\\..\\..\\lib\\Synch_Libd.exp
27>Embedding manifest...
26>.\\TS_Clerk_Handler.cpp(190) : warning C4244: 'initializing' : conversion from 'time_t' to 'ACE_UINT32', possible loss of data
26>.\\TS_Clerk_Handler.cpp(295) : warning C4244: '=' : conversion from 'time_t' to 'ACE_UINT32', possible loss of data
26>.\\TS_Clerk_Handler.cpp(353) : warning C4244: '=' : conversion from 'time_t' to 'long', possible loss of data
26>.\\TS_Clerk_Handler.cpp(421) : warning C4244: '=' : conversion from 'time_t' to 'long', possible loss of data
26>Token_Handler.cpp
27>Build log was saved at "file://c:\\ace\\ACE_wrappers\\performance-tests\\Synch-Benchmarks\\Synch_Lib\\Debug\\Synch_Lib_vc8\\BuildLog.htm"
27>Synch_Lib - 0 error(s), 0 warning(s)
28>------ Build started: Project: HTBP, Configuration: Debug Win32 ------
28>Compiling...
28>HTBP_Stream.cpp
26>Server_Logging_Handler_T.cpp
28>HTBP_Session.cpp
26>Server_Logging_Handler.cpp
28>HTBP_Outside_Squid_Filter.cpp
28>HTBP_Notifier.cpp
26>Name_Handler.cpp
28>HTBP_Inside_Squid_Filter.cpp
26>Log_Message_Receiver.cpp
26>Client_Logging_Handler.cpp
28>HTBP_ID_Requestor.cpp
26>Base_Optimizer.cpp
28>HTBP_Filter_Factory.cpp
26>Generating Code...
26>Compiling manifest to resources...
26>Linking...
26> Creating library ..\\..\\lib\\netsvcsd.lib and object ..\\..\\lib\\netsvcsd.exp
28>HTBP_Filter.cpp
26>Embedding manifest...
26>Build log was saved at "file://c:\\ace\\ACE_wrappers\\netsvcs\\lib\\Debug\\netsvcs_vc8\\BuildLog.htm"
26>netsvcs - 0 error(s), 5 warning(s)
29>------ Build started: Project: RMCast, Configuration: Debug Win32 ------
29>Compiling...
28>HTBP_Environment.cpp
29>Stack.cpp
28>HTBP_Channel.cpp
29>Socket.cpp
28>HTBP_Addr.cpp
29>Simulator.cpp
28>Generating Code...
29>.\\Simulator.cpp(12) : warning C4244: 'argument' : conversion from 'time_t' to 'unsigned int', possible loss of data
29>Retransmit.cpp
28>Compiling manifest to resources...
28>Linking...
28> Creating library ..\\..\\..\\lib\\ACE_HTBPd.lib and object ..\\..\\..\\lib\\ACE_HTBPd.exp
28>Embedding manifest...
29>Reassemble.cpp
28>Build log was saved at "file://c:\\ace\\ACE_wrappers\\protocols\\ace\\HTBP\\Debug\\HTBP_vc8\\BuildLog.htm"
28>HTBP - 0 error(s), 0 warning(s)
30>------ Build started: Project: TMCast, Configuration: Debug Win32 ------
30>Compiling...
30>Protocol.cpp
30>MTQueue.cpp
29>Protocol.cpp
30>Group.cpp
29>Link.cpp
30>Generating Code...
30>Compiling manifest to resources...
30>Linking...
30> Creating library ..\\..\\..\\lib\\ACE_TMCastd.lib and object ..\\..\\..\\lib\\ACE_TMCastd.exp
30>Embedding manifest...
29>.\\Link.cpp(33) : warning C4244: 'argument' : conversion from 'time_t' to 'unsigned int', possible loss of data
29>Fragment.cpp
30>Build log was saved at "file://c:\\ace\\ACE_wrappers\\protocols\\ace\\TMCast\\Debug\\TMCast_vc8\\BuildLog.htm"
30>TMCast - 0 error(s), 0 warning(s)
31>------ Build started: Project: Based_Pointer_Test_Lib, Configuration: Debug Win32 ------
31>Compiling...
31>Based_Pointer_Test_Lib.cpp
29>Flow.cpp
31>Compiling manifest to resources...
31>Linking...
31> Creating library ..\\lib\\Based_Pointer_Test_Libd.lib and object ..\\lib\\Based_Pointer_Test_Libd.exp
31>Embedding manifest...
31>Build log was saved at "file://c:\\ace\\ACE_wrappers\\tests\\Debug\\Based_Pointer_Test_Lib_vc8\\BuildLog.htm"
31>Based_Pointer_Test_Lib - 0 error(s), 0 warning(s)
29>Acknowledge.cpp
32>------ Build started: Project: DLL_Test_Lib, Configuration: Debug Win32 ------
32>Compiling...
32>DLL_Test_Impl.cpp
32>Compiling manifest to resources...
32>Linking...
32> Creating library ..\\lib\\DLL_Test_Libd.lib and object ..\\lib\\DLL_Test_Libd.exp
32>Embedding manifest...
29>Generating Code...
32>Build log was saved at "file://c:\\ace\\ACE_wrappers\\tests\\Debug\\DLL_Test_Lib_vc8\\BuildLog.htm"
32>DLL_Test_Lib - 0 error(s), 0 warning(s)
33>------ Build started: Project: Export_Lib, Configuration: Debug Win32 ------
33>Compiling...
33>dll.cpp
29>Compiling manifest to resources...
29>Linking...
29> Creating library ..\\..\\..\\lib\\ACE_RMCastd.lib and object ..\\..\\..\\lib\\ACE_RMCastd.exp
29>Embedding manifest...
33>Compiling manifest to resources...
33>Linking...
33> Creating library ..\\..\\lib\\Export_Libd.lib and object ..\\..\\lib\\Export_Libd.exp
29>Build log was saved at "file://c:\\ace\\ACE_wrappers\\protocols\\ace\\RMCast\\Debug\\RMCast_vc8\\BuildLog.htm"
29>RMCast - 0 error(s), 2 warning(s)
33>Embedding manifest...
33>Build log was saved at "file://c:\\ace\\ACE_wrappers\\examples\\Export\\Debug\\Export_Lib_vc8\\BuildLog.htm"
33>Export_Lib - 0 error(s), 0 warning(s)
34>------ Build started: Project: Service_Config_DLL, Configuration: Debug Win32 ------
35>------ Build started: Project: Framework_Component_DLL, Configuration: Debug Win32 ------
34>Compiling...
35>Compiling...
35>Framework_Component_DLL.cpp
34>Service_Config_DLL.cpp
34>Compiling manifest to resources...
35>Compiling manifest to resources...
35>Linking...
34>Linking...
34> Creating library ..\\lib\\Service_Config_DLLd.lib and object ..\\lib\\Service_Config_DLLd.exp
35> Creating library ..\\lib\\Framework_Component_DLLd.lib and object ..\\lib\\Framework_Component_DLLd.exp
35>Embedding manifest...
34>Embedding manifest...
35>Build log was saved at "file://c:\\ace\\ACE_wrappers\\tests\\Debug\\Framework_Component_DLL_vc8\\BuildLog.htm"
35>Framework_Component_DLL - 0 error(s), 0 warning(s)
34>Build log was saved at "file://c:\\ace\\ACE_wrappers\\tests\\Debug\\Service_Config_DLL_vc8\\BuildLog.htm"
34>Service_Config_DLL - 0 error(s), 0 warning(s)
36>------ Build started: Project: Semaphore_Test, Configuration: Debug Win32 ------
36>Compiling...
36>Semaphore_Test.cpp
37>------ Build started: Project: SV_Shared_Memory_Test, Configuration: Debug Win32 ------
37>Compiling...
36>.\\Semaphore_Test.cpp(204) : warning C4244: 'argument' : conversion from 'time_t' to 'u_int', possible loss of data
37>SV_Shared_Memory_Test.cpp
36>Main.cpp
36>Generating Code...
36>Compiling manifest to resources...
36>Linking...
36>Embedding manifest...
37>Main.cpp
36>Build log was saved at "file://c:\\ace\\ACE_wrappers\\tests\\Debug\\Semaphore_Test_vc8\\BuildLog.htm"
36>Semaphore_Test - 0 error(s), 1 warning(s)
37>Generating Code...
37>Compiling manifest to resources...
37>Linking...
37>Embedding manifest...
38>------ Build started: Project: SString_Test, Configuration: Debug Win32 ------
38>Compiling...
37>Build log was saved at "file://c:\\ace\\ACE_wrappers\\tests\\Debug\\SV_Shared_Memory_Test_vc8\\BuildLog.htm"
37>SV_Shared_Memory_Test - 0 error(s), 0 warning(s)
38>SString_Test.cpp
38>Main.cpp
39>------ Build started: Project: SPIPE_Test, Configuration: Debug Win32 ------
39>Compiling...
39>SPIPE_Test.cpp
38>Generating Code...
38>Compiling manifest to resources...
38>Linking...
38>Embedding manifest...
38>Build log was saved at "file://c:\\ace\\ACE_wrappers\\tests\\Debug\\SString_Test_vc8\\BuildLog.htm"
38>SString_Test - 0 error(s), 0 warning(s)
39>Main.cpp
39>Generating Code...
39>Compiling manifest to resources...
39>Linking...
40>------ Build started: Project: SOCK_Test, Configuration: Debug Win32 ------
39>Embedding manifest...
40>Compiling...
40>SOCK_Test.cpp
39>Build log was saved at "file://c:\\ace\\ACE_wrappers\\tests\\Debug\\SPIPE_Test_vc8\\BuildLog.htm"
39>SPIPE_Test - 0 error(s), 0 warning(s)
41>------ Build started: Project: SOCK_Test_IPv6, Configuration: Debug Win32 ------
41>Compiling...
41>SOCK_Test_IPv6.cpp
40>Main.cpp
40>Generating Code...
40>Compiling manifest to resources...
40>Linking...
40>Embedding manifest...
41>Main.cpp
40>Build log was saved at "file://c:\\ace\\ACE_wrappers\\tests\\Debug\\SOCK_Test_vc8\\BuildLog.htm"
40>SOCK_Test - 0 error(s), 0 warning(s)
41>Generating Code...
41>Compiling manifest to resources...
41>Linking...
42>------ Build started: Project: SOCK_Send_Recv_Test, Configuration: Debug Win32 ------
42>Compiling...
42>SOCK_Send_Recv_Test.cpp
41>Embedding manifest...
41>Build log was saved at "file://c:\\ace\\ACE_wrappers\\tests\\Debug\\SOCK_Test_IPv6_vc8\\BuildLog.htm"
41>SOCK_Test_IPv6 - 0 error(s), 0 warning(s)
42>Main.cpp
42>Generating Code...
42>Compiling manifest to resources...
42>Linking...
42>Embedding manifest...
43>------ Build started: Project: SOCK_Send_Recv_Test_IPV6, Configuration: Debug Win32 ------
43>Compiling...
43>SOCK_Send_Recv_Test_IPV6.cpp
42>Build log was saved at "file://c:\\ace\\ACE_wrappers\\tests\\Debug\\SOCK_Send_Recv_Test_vc8\\BuildLog.htm"
42>SOCK_Send_Recv_Test - 0 error(s), 0 warning(s)
43>Main.cpp
44>------ Build started: Project: SOCK_SEQPACK_SCTP_Test, Configuration: Debug Win32 ------
44>Compiling...
43>Generating Code...
44>SOCK_SEQPACK_SCTP_Test.cpp
43>Compiling manifest to resources...
43>Linking...
43>Embedding manifest...
43>Build log was saved at "file://c:\\ace\\ACE_wrappers\\tests\\Debug\\SOCK_Send_Recv_Test_IPV6_vc8\\BuildLog.htm"
43>SOCK_Send_Recv_Test_IPV6 - 0 error(s), 0 warning(s)
45>------ Build started: Project: SOCK_Netlink_Test, Configuration: Debug Win32 ------
45>Compiling...
45>SOCK_Netlink_Test.cpp
44>Main.cpp
44>Generating Code...
44>Compiling manifest to resources...
44>Linking...
45>Main.cpp
44>Embedding manifest...
45>Generating Code...
45>Compiling manifest to resources...
45>Linking...
44>Build log was saved at "file://c:\\ace\\ACE_wrappers\\tests\\Debug\\SOCK_SEQPACK_SCTP_Test_vc8\\BuildLog.htm"
44>SOCK_SEQPACK_SCTP_Test - 0 error(s), 0 warning(s)
45>Embedding manifest...
45>Build log was saved at "file://c:\\ace\\ACE_wrappers\\tests\\Debug\\SOCK_Netlink_Test_vc8\\BuildLog.htm"
45>SOCK_Netlink_Test - 0 error(s), 0 warning(s)
46>------ Build started: Project: SOCK_Dgram_Test, Configuration: Debug Win32 ------
47>------ Build started: Project: SOCK_Dgram_Bcast_Test, Configuration: Debug Win32 ------
46>Compiling...
47>Compiling...
46>SOCK_Dgram_Test.cpp
47>SOCK_Dgram_Bcast_Test.cpp
46>Main.cpp
47>Main.cpp
46>Generating Code...
46>Compiling manifest to resources...
47>Generating Code...
46>Linking...
47>Compiling manifest to resources...
47>Linking...
46>Embedding manifest...
47>Embedding manifest...
46>Build log was saved at "file://c:\\ace\\ACE_wrappers\\tests\\Debug\\SOCK_Dgram_Test_vc8\\BuildLog.htm"
46>SOCK_Dgram_Test - 0 error(s), 0 warning(s)
47>Build log was saved at "file://c:\\ace\\ACE_wrappers\\tests\\Debug\\SOCK_Dgram_Bcast_Test_vc8\\BuildLog.htm"
47>SOCK_Dgram_Bcast_Test - 0 error(s), 0 warning(s)
48>------ Build started: Project: SOCK_Connector_Test, Configuration: Debug Win32 ------
48>Compiling...
48>SOCK_Connector_Test.cpp
49>------ Build started: Project: Reverse_Lock_Test, Configuration: Debug Win32 ------
49>Compiling...
49>Reverse_Lock_Test.cpp
48>Main.cpp
49>Main.cpp
48>Generating Code...
48>Compiling manifest to resources...
48>Linking...
48>Embedding manifest...
49>Generating Code...
49>Compiling manifest to resources...
49>Linking...
48>Build log was saved at "file://c:\\ace\\ACE_wrappers\\tests\\Debug\\SOCK_Connector_Test_vc8\\BuildLog.htm"
48>SOCK_Connector_Test - 0 error(s), 0 warning(s)
49>Embedding manifest...
50>------ Build started: Project: Reference_Counted_Event_Handler_Test, Configuration: Debug Win32 ------
50>Compiling...
50>Reference_Counted_Event_Handler_Test.cpp
49>Build log was saved at "file://c:\\ace\\ACE_wrappers\\tests\\Debug\\Reverse_Lock_Test_vc8\\BuildLog.htm"
49>Reverse_Lock_Test - 0 error(s), 0 warning(s)
51>------ Build started: Project: Refcounted_Auto_Ptr_Test, Configuration: Debug Win32 ------
51>Compiling...
51>Refcounted_Auto_Ptr_Test.cpp
50>Main.cpp
50>Generating Code...
50>Compiling manifest to resources...
50>Linking...
50> Creating library .\\Reference_Counted_Event_Handler_Test.lib and object .\\Reference_Counted_Event_Handler_Test.exp
50>Embedding manifest...
50>Build log was saved at "file://c:\\ace\\ACE_wrappers\\tests\\Debug\\Reference_Counted_Event_Handler_Test_vc8\\BuildLog.htm"
50>Reference_Counted_Event_Handler_Test - 0 error(s), 0 warning(s)
51>Main.cpp
51>Generating Code...
51>Compiling manifest to resources...
51>Linking...
51> Creating library .\\Refcounted_Auto_Ptr_Test.lib and object .\\Refcounted_Auto_Ptr_Test.exp
52>------ Build started: Project: Recursive_Mutex_Test, Configuration: Debug Win32 ------
51>Embedding manifest...
52>Compiling...
52>Recursive_Mutex_Test.cpp
51>Build log was saved at "file://c:\\ace\\ACE_wrappers\\tests\\Debug\\Refcounted_Auto_Ptr_Test_vc8\\BuildLog.htm"
51>Refcounted_Auto_Ptr_Test - 0 error(s), 0 warning(s)
52>.\\Recursive_Mutex_Test.cpp(94) : warning C4244: 'argument' : conversion from 'time_t' to 'u_int', possible loss of data
52>Main.cpp
52>Generating Code...
52>Compiling manifest to resources...
52>Linking...
52>Embedding manifest...
53>------ Build started: Project: Recursive_Condition_Test, Configuration: Debug Win32 ------
53>Compiling...
53>Recursive_Condition_Test.cpp
52>Build log was saved at "file://c:\\ace\\ACE_wrappers\\tests\\Debug\\Recursive_Mutex_Test_vc8\\BuildLog.htm"
52>Recursive_Mutex_Test - 0 error(s), 1 warning(s)
54>------ Build started: Project: Recursive_Condition_Bug_Test, Configuration: Debug Win32 ------
54>Compiling...
54>Recursive_Condition_Bug_Test.cpp
53>Main.cpp
53>Generating Code...
53>Compiling manifest to resources...
53>Linking...
53> Creating library .\\Recursive_Condition_Test.lib and object .\\Recursive_Condition_Test.exp
53>Embedding manifest...
54>Main.cpp
53>Build log was saved at "file://c:\\ace\\ACE_wrappers\\tests\\Debug\\Recursive_Condition_Test_vc8\\BuildLog.htm"
53>Recursive_Condition_Test - 0 error(s), 0 warning(s)
54>Generating Code...
54>Compiling manifest to resources...
54>Linking...
54> Creating library .\\Recursive_Condition_Bug_Test.lib and object .\\Recursive_Condition_Bug_Test.exp
54>Embedding manifest...
55>------ Build started: Project: Reader_Writer_Test, Configuration: Debug Win32 ------
54>Build log was saved at "file://c:\\ace\\ACE_wrappers\\tests\\Debug\\Recursive_Condition_Bug_Test_vc8\\BuildLog.htm"
54>Recursive_Condition_Bug_Test - 0 error(s), 0 warning(s)
55>Compiling...
55>Reader_Writer_Test.cpp
55>Main.cpp
55>Generating Code...
55>Compiling manifest to resources...
55>Linking...
55>Embedding manifest...
56>------ Build started: Project: Reactors_Test, Configuration: Debug Win32 ------
56>Compiling...
56>Reactors_Test.cpp
55>Build log was saved at "file://c:\\ace\\ACE_wrappers\\tests\\Debug\\Reader_Writer_Test_vc8\\BuildLog.htm"
55>Reader_Writer_Test - 0 error(s), 0 warning(s)
57>------ Build started: Project: Reactor_Timer_Test, Configuration: Debug Win32 ------
57>Compiling...
57>Reactor_Timer_Test.cpp
56>Main.cpp
56>Generating Code...
56>Compiling manifest to resources...
56>Linking...
56>Embedding manifest...
57>Main.cpp
56>Build log was saved at "file://c:\\ace\\ACE_wrappers\\tests\\Debug\\Reactors_Test_vc8\\BuildLog.htm"
56>Reactors_Test - 0 error(s), 0 warning(s)
57>Generating Code...
57>Compiling manifest to resources...
57>Linking...
57>Embedding manifest...
58>------ Build started: Project: Reactor_Registration_Test, Configuration: Debug Win32 ------
58>Compiling...
58>Reactor_Registration_Test.cpp
57>Build log was saved at "file://c:\\ace\\ACE_wrappers\\tests\\Debug\\Reactor_Timer_Test_vc8\\BuildLog.htm"
57>Reactor_Timer_Test - 0 error(s), 0 warning(s)
59>------ Build started: Project: Reactor_Performance_Test, Configuration: Debug Win32 ------
59>Compiling...
59>Reactor_Performance_Test.cpp
58>Main.cpp
58>Generating Code...
58>Compiling manifest to resources...
58>Linking...
58>Embedding manifest...
58>Build log was saved at "file://c:\\ace\\ACE_wrappers\\tests\\Debug\\Reactor_Registration_Test_vc8\\BuildLog.htm"
58>Reactor_Registration_Test - 0 error(s), 0 warning(s)
59>Main.cpp
60>------ Build started: Project: Reactor_Notify_Test, Configuration: Debug Win32 ------
60>Compiling...
60>Reactor_Notify_Test.cpp
59>Generating Code...
59>Compiling manifest to resources...
59>Linking...
59> Creating library .\\Reactor_Performance_Test.lib and object .\\Reactor_Performance_Test.exp
59>Embedding manifest...
59>Build log was saved at "file://c:\\ace\\ACE_wrappers\\tests\\Debug\\Reactor_Performance_Test_vc8\\BuildLog.htm"
59>Reactor_Performance_Test - 0 error(s), 0 warning(s)
60>Main.cpp
60>Generating Code...
60>Compiling manifest to resources...
60>Linking...
60> Creating library .\\Reactor_Notify_Test.lib and object .\\Reactor_Notify_Test.exp
60>Embedding manifest...
61>------ Build started: Project: Reactor_Notification_Queue_Test, Configuration: Debug Win32 ------
61>Compiling...
61>Reactor_Notification_Queue_Test.cpp
60>Build log was saved at "file://c:\\ace\\ACE_wrappers\\tests\\Debug\\Reactor_Notify_Test_vc8\\BuildLog.htm"
60>Reactor_Notify_Test - 0 error(s), 0 warning(s)
62>------ Build started: Project: Reactor_Exceptions_Test, Configuration: Debug Win32 ------
62>Compiling...
61>Main.cpp
62>Reactor_Exceptions_Test.cpp
61>Generating Code...
61>Compiling manifest to resources...
61>Linking...
61>Embedding manifest...
62>Main.cpp
61>Build log was saved at "file://c:\\ace\\ACE_wrappers\\tests\\Debug\\Reactor_Notification_Queue_Test_vc8\\BuildLog.htm"
61>Reactor_Notification_Queue_Test - 0 error(s), 0 warning(s)
62>Generating Code...
62>Compiling manifest to resources...
62>Linking...
63>------ Build started: Project: Reactor_Dispatch_Order_Test, Configuration: Debug Win32 ------
62>Embedding manifest...
63>Compiling...
63>Reactor_Dispatch_Order_Test.cpp
62>Build log was saved at "file://c:\\ace\\ACE_wrappers\\tests\\Debug\\Reactor_Exceptions_Test_vc8\\BuildLog.htm"
62>Reactor_Exceptions_Test - 0 error(s), 0 warning(s)
64>------ Build started: Project: RB_Tree_Test, Configuration: Debug Win32 ------
64>Compiling...
64>RB_Tree_Test.cpp
63>Main.cpp
63>Generating Code...
64>Main.cpp
63>Compiling manifest to resources...
63>Linking...
63> Creating library .\\Reactor_Dispatch_Order_Test.lib and object .\\Reactor_Dispatch_Order_Test.exp
64>Generating Code...
63>Embedding manifest...
64>Compiling manifest to resources...
64>Linking...
63>Build log was saved at "file://c:\\ace\\ACE_wrappers\\tests\\Debug\\Reactor_Dispatch_Order_Test_vc8\\BuildLog.htm"
63>Reactor_Dispatch_Order_Test - 0 error(s), 0 warning(s)
64>Embedding manifest...
64>Build log was saved at "file://c:\\ace\\ACE_wrappers\\tests\\Debug\\RB_Tree_Test_vc8\\BuildLog.htm"
64>RB_Tree_Test - 0 error(s), 0 warning(s)
65>------ Build started: Project: Process_Strategy_Test, Configuration: Debug Win32 ------
65>Compiling...
65>Process_Strategy_Test.cpp
66>------ Build started: Project: Process_Semaphore_Test, Configuration: Debug Win32 ------
66>Compiling...
66>Process_Semaphore_Test.cpp
66>Main.cpp
66>Generating Code...
66>Compiling manifest to resources...
66>Linking...
66>Embedding manifest...
65>Main.cpp
66>Build log was saved at "file://c:\\ace\\ACE_wrappers\\tests\\Debug\\Process_Semaphore_Test_vc8\\BuildLog.htm"
66>Process_Semaphore_Test - 0 error(s), 0 warning(s)
65>Generating Code...
67>------ Build started: Project: Process_Mutex_Test, Configuration: Debug Win32 ------
65>Compiling manifest to resources...
65>Linking...
67>Compiling...
65> Creating library .\\Process_Strategy_Test.lib and object .\\Process_Strategy_Test.exp
67>Process_Mutex_Test.cpp
65>Embedding manifest...
65>Build log was saved at "file://c:\\ace\\ACE_wrappers\\tests\\Debug\\Process_Strategy_Test_vc8\\BuildLog.htm"
65>Process_Strategy_Test - 0 error(s), 0 warning(s)
67>Main.cpp
67>Generating Code...
68>------ Build started: Project: Process_Manual_Event_Test, Configuration: Debug Win32 ------
67>Compiling manifest to resources...
67>Linking...
68>Compiling...
68>Process_Manual_Event_Test.cpp
67>Embedding manifest...
67>Build log was saved at "file://c:\\ace\\ACE_wrappers\\tests\\Debug\\Process_Mutex_Test_vc8\\BuildLog.htm"
67>Process_Mutex_Test - 0 error(s), 0 warning(s)
68>Main.cpp
68>Generating Code...
68>Compiling manifest to resources...
68>Linking...
68>Embedding manifest...
69>------ Build started: Project: Process_Manager_Test, Configuration: Debug Win32 ------
68>Build log was saved at "file://c:\\ace\\ACE_wrappers\\tests\\Debug\\Process_Manual_Event_Test_vc8\\BuildLog.htm"
68>Process_Manual_Event_Test - 0 error(s), 0 warning(s)
69>Compiling...
69>Process_Manager_Test.cpp
69>Main.cpp
69>Generating Code...
69>Compiling manifest to resources...
69>Linking...
69>Embedding manifest...
70>------ Build started: Project: Proactor_Timer_Test, Configuration: Debug Win32 ------
70>Compiling...
70>Proactor_Timer_Test.cpp
70>Main.cpp
70>Generating Code...
70>Compiling manifest to resources...
70>Linking...
69>Build log was saved at "file://c:\\ace\\ACE_wrappers\\tests\\Debug\\Process_Manager_Test_vc8\\BuildLog.htm"
69>Process_Manager_Test - 0 error(s), 0 warning(s)
70>Embedding manifest...
71>------ Build started: Project: Proactor_Test, Configuration: Debug Win32 ------
71>Compiling...
71>Proactor_Test.cpp
70>Build log was saved at "file://c:\\ace\\ACE_wrappers\\tests\\Debug\\Proactor_Timer_Test_vc8\\BuildLog.htm"
70>Proactor_Timer_Test - 0 error(s), 0 warning(s)
72>------ Build started: Project: Proactor_Test_IPV6, Configuration: Debug Win32 ------
72>Compiling...
72>Proactor_Test_IPV6.cpp
71>Main.cpp
71>Generating Code...
71>Compiling manifest to resources...
71>Linking...
71> Creating library .\\Proactor_Test.lib and object .\\Proactor_Test.exp
71>Embedding manifest...
72>Main.cpp
71>Build log was saved at "file://c:\\ace\\ACE_wrappers\\tests\\Debug\\Proactor_Test_vc8\\BuildLog.htm"
71>Proactor_Test - 0 error(s), 0 warning(s)
72>Generating Code...
72>Compiling manifest to resources...
72>Linking...
72> Creating library .\\Proactor_Test_IPV6.lib and object .\\Proactor_Test_IPV6.exp
73>------ Build started: Project: Proactor_Scatter_Gather_Test, Configuration: Debug Win32 ------
73>Compiling...
73>Proactor_Scatter_Gather_Test.cpp
72>Embedding manifest...
72>Build log was saved at "file://c:\\ace\\ACE_wrappers\\tests\\Debug\\Proactor_Test_IPV6_vc8\\BuildLog.htm"
72>Proactor_Test_IPV6 - 0 error(s), 0 warning(s)
74>------ Build started: Project: Priority_Task_Test, Configuration: Debug Win32 ------
74>Compiling...
74>Priority_Task_Test.cpp
73>.\\Proactor_Scatter_Gather_Test.cpp(1153) : warning C4244: 'initializing' : conversion from 'ACE_LOFF_T' to 'const size_t', possible loss of data
73>Main.cpp
73>Generating Code...
73>Compiling manifest to resources...
73>Linking...
73> Creating library .\\Proactor_Scatter_Gather_Test.lib and object .\\Proactor_Scatter_Gather_Test.exp
73>Embedding manifest...
74>Main.cpp
73>Build log was saved at "file://c:\\ace\\ACE_wrappers\\tests\\Debug\\Proactor_Scatter_Gather_Test_vc8\\BuildLog.htm"
73>Proactor_Scatter_Gather_Test - 0 error(s), 1 warning(s)
75>------ Build started: Project: Priority_Reactor_Test, Configuration: Debug Win32 ------
75>Compiling...
74>Generating Code...
75>Priority_Reactor_Test.cpp
74>Compiling manifest to resources...
74>Linking...
74>Embedding manifest...
74>Build log was saved at "file://c:\\ace\\ACE_wrappers\\tests\\Debug\\Priority_Task_Test_vc8\\BuildLog.htm"
74>Priority_Task_Test - 0 error(s), 0 warning(s)
76>------ Build started: Project: Priority_Buffer_Test, Configuration: Debug Win32 ------
76>Compiling...
76>Priority_Buffer_Test.cpp
75>Main.cpp
75>Generating Code...
75>Compiling manifest to resources...
75>Linking...
75> Creating library .\\Priority_Reactor_Test.lib and object .\\Priority_Reactor_Test.exp
76>Main.cpp
75>Embedding manifest...
76>Generating Code...
75>Build log was saved at "file://c:\\ace\\ACE_wrappers\\tests\\Debug\\Priority_Reactor_Test_vc8\\BuildLog.htm"
75>Priority_Reactor_Test - 0 error(s), 0 warning(s)
77>------ Build started: Project: Pipe_Test, Configuration: Debug Win32 ------
76>Compiling manifest to resources...
76>Linking...
77>Compiling...
76> Creating library .\\Priority_Buffer_Test.lib and object .\\Priority_Buffer_Test.exp
77>Pipe_Test.cpp
76>Embedding manifest...
76>Build log was saved at "file://c:\\ace\\ACE_wrappers\\tests\\Debug\\Priority_Buffer_Test_vc8\\BuildLog.htm"
76>Priority_Buffer_Test - 0 error(s), 0 warning(s)
77>Main.cpp
77>Generating Code...
77>Compiling manifest to resources...
77>Linking...
77>Embedding manifest...
78>------ Build started: Project: OrdMultiSet_Test, Configuration: Debug Win32 ------
78>Compiling...
78>OrdMultiSet_Test.cpp
77>Build log was saved at "file://c:\\ace\\ACE_wrappers\\tests\\Debug\\Pipe_Test_vc8\\BuildLog.htm"
77>Pipe_Test - 0 error(s), 0 warning(s)
78>Main.cpp
78>Generating Code...
79>------ Build started: Project: Obstack_Test, Configuration: Debug Win32 ------
78>Compiling manifest to resources...
79>Compiling...
78>Linking...
79>Obstack_Test.cpp
78>Embedding manifest...
78>Build log was saved at "file://c:\\ace\\ACE_wrappers\\tests\\Debug\\OrdMultiSet_Test_vc8\\BuildLog.htm"
78>OrdMultiSet_Test - 0 error(s), 0 warning(s)
79>Main.cpp
79>Generating Code...
79>Compiling manifest to resources...
79>Linking...
79>Embedding manifest...
80>------ Build started: Project: Object_Manager_Test, Configuration: Debug Win32 ------
79>Build log was saved at "file://c:\\ace\\ACE_wrappers\\tests\\Debug\\Obstack_Test_vc8\\BuildLog.htm"
79>Obstack_Test - 0 error(s), 0 warning(s)
80>Compiling...
80>Object_Manager_Test.cpp
81>------ Build started: Project: OS_Test, Configuration: Debug Win32 ------
81>Compiling...
81>OS_Test.cpp
80>Main.cpp
80>Generating Code...
81>Main.cpp
80>Compiling manifest to resources...
80>Linking...
80> Creating library .\\Object_Manager_Test.lib and object .\\Object_Manager_Test.exp
80>Embedding manifest...
81>Generating Code...
81>Compiling manifest to resources...
81>Linking...
80>Build log was saved at "file://c:\\ace\\ACE_wrappers\\tests\\Debug\\Object_Manager_Test_vc8\\BuildLog.htm"
80>Object_Manager_Test - 0 error(s), 0 warning(s)
81>Embedding manifest...
82>------ Build started: Project: Notify_Performance_Test, Configuration: Debug Win32 ------
82>Compiling...
82>Notify_Performance_Test.cpp
81>Build log was saved at "file://c:\\ace\\ACE_wrappers\\tests\\Debug\\OS_Test_vc8\\BuildLog.htm"
81>OS_Test - 0 error(s), 0 warning(s)
83>------ Build started: Project: NonBlocking_Conn_Test, Configuration: Debug Win32 ------
83>Compiling...
83>NonBlocking_Conn_Test.cpp
82>Main.cpp
82>Generating Code...
82>Compiling manifest to resources...
82>Linking...
82> Creating library .\\Notify_Performance_Test.lib and object .\\Notify_Performance_Test.exp
83>Main.cpp
82>Embedding manifest...
83>Generating Code...
82>Build log was saved at "file://c:\\ace\\ACE_wrappers\\tests\\Debug\\Notify_Performance_Test_vc8\\BuildLog.htm"
82>Notify_Performance_Test - 0 error(s), 0 warning(s)
84>------ Build started: Project: New_Fail_Test, Configuration: Debug Win32 ------
83>Compiling manifest to resources...
83>Linking...
84>Compiling...
83> Creating library .\\NonBlocking_Conn_Test.lib and object .\\NonBlocking_Conn_Test.exp
84>New_Fail_Test.cpp
83>Embedding manifest...
83>Build log was saved at "file://c:\\ace\\ACE_wrappers\\tests\\Debug\\NonBlocking_Conn_Test_vc8\\BuildLog.htm"
83>NonBlocking_Conn_Test - 0 error(s), 0 warning(s)
84>Main.cpp
84>Generating Code...
84>Compiling manifest to resources...
84>Linking...
84> Creating library .\\New_Fail_Test.lib and object .\\New_Fail_Test.exp
84>Embedding manifest...
84>Build log was saved at "file://c:\\ace\\ACE_wrappers\\tests\\Debug\\New_Fail_Test_vc8\\BuildLog.htm"
84>New_Fail_Test - 0 error(s), 0 warning(s)
85>------ Build started: Project: Network_Adapters_Test, Configuration: Debug Win32 ------
86>------ Build started: Project: Naming_Test, Configuration: Debug Win32 ------
86>Compiling...
85>Compiling...
86>Naming_Test.cpp
85>Network_Adapters_Test.cpp
85>Main.cpp
85>Generating Code...
86>Main.cpp
86>Generating Code...
86>Compiling manifest to resources...
86>Linking...
85>Compiling manifest to resources...
85>Linking...
86> Creating library .\\Naming_Test.lib and object .\\Naming_Test.exp
85>Embedding manifest...
86>Embedding manifest...
85>Build log was saved at "file://c:\\ace\\ACE_wrappers\\tests\\Debug\\Network_Adapters_Test_vc8\\BuildLog.htm"
85>Network_Adapters_Test - 0 error(s), 0 warning(s)
86>Build log was saved at "file://c:\\ace\\ACE_wrappers\\tests\\Debug\\Naming_Test_vc8\\BuildLog.htm"
86>Naming_Test - 0 error(s), 0 warning(s)
87>------ Build started: Project: Multihomed_INET_Addr_Test, Configuration: Debug Win32 ------
87>Compiling...
87>Multihomed_INET_Addr_Test.cpp
88>------ Build started: Project: Multihomed_INET_Addr_Test_IPV6, Configuration: Debug Win32 ------
88>Compiling...
88>Multihomed_INET_Addr_Test_IPV6.cpp
87>Main.cpp
87>Generating Code...
87>Compiling manifest to resources...
87>Linking...
88>Main.cpp
87>Embedding manifest...
88>Generating Code...
87>Build log was saved at "file://c:\\ace\\ACE_wrappers\\tests\\Debug\\Multihomed_INET_Addr_Test_vc8\\BuildLog.htm"
87>Multihomed_INET_Addr_Test - 0 error(s), 0 warning(s)
88>Compiling manifest to resources...
88>Linking...
88>Embedding manifest...
89>------ Build started: Project: Multicast_Test, Configuration: Debug Win32 ------
89>Compiling...
88>Build log was saved at "file://c:\\ace\\ACE_wrappers\\tests\\Debug\\Multihomed_INET_Addr_Test_IPV6_vc8\\BuildLog.htm"
88>Multihomed_INET_Addr_Test_IPV6 - 0 error(s), 0 warning(s)
89>Multicast_Test.cpp
90>------ Build started: Project: Multicast_Test_IPV6, Configuration: Debug Win32 ------
90>Compiling...
90>Multicast_Test_IPV6.cpp
89>Main.cpp
90>Main.cpp
89>Generating Code...
89>Compiling manifest to resources...
89>Linking...
89> Creating library .\\Multicast_Test.lib and object .\\Multicast_Test.exp
90>Generating Code...
90>Compiling manifest to resources...
90>Linking...
89>Embedding manifest...
90> Creating library .\\Multicast_Test_IPV6.lib and object .\\Multicast_Test_IPV6.exp
90>Embedding manifest...
89>Build log was saved at "file://c:\\ace\\ACE_wrappers\\tests\\Debug\\Multicast_Test_vc8\\BuildLog.htm"
89>Multicast_Test - 0 error(s), 0 warning(s)
91>------ Build started: Project: Message_Queue_Test, Configuration: Debug Win32 ------
90>Build log was saved at "file://c:\\ace\\ACE_wrappers\\tests\\Debug\\Multicast_Test_IPV6_vc8\\BuildLog.htm"
90>Multicast_Test_IPV6 - 0 error(s), 0 warning(s)
91>Compiling...
91>Message_Queue_Test.cpp
92>------ Build started: Project: Message_Queue_Test_Ex, Configuration: Debug Win32 ------
92>Compiling...
92>Message_Queue_Test_Ex.cpp
91>Main.cpp
91>Generating Code...
91>Compiling manifest to resources...
91>Linking...
91> Creating library .\\Message_Queue_Test.lib and object .\\Message_Queue_Test.exp
92>Main.cpp
91>Embedding manifest...
91>Build log was saved at "file://c:\\ace\\ACE_wrappers\\tests\\Debug\\Message_Queue_Test_vc8\\BuildLog.htm"
91>Message_Queue_Test - 0 error(s), 0 warning(s)
92>Generating Code...
93>------ Build started: Project: Message_Queue_Notifications_Test, Configuration: Debug Win32 ------
92>Compiling manifest to resources...
93>Compiling...
93>Message_Queue_Notifications_Test.cpp
93>Main.cpp
93>Generating Code...
92>Linking...
93>Compiling manifest to resources...
93>Linking...
92> Creating library .\\Message_Queue_Test_Ex.lib and object .\\Message_Queue_Test_Ex.exp
93> Creating library .\\Message_Queue_Notifications_Test.lib and object .\\Message_Queue_Notifications_Test.exp
92>Embedding manifest...
93>Embedding manifest...
92>Build log was saved at "file://c:\\ace\\ACE_wrappers\\tests\\Debug\\Message_Queue_Test_Ex_vc8\\BuildLog.htm"
92>Message_Queue_Test_Ex - 0 error(s), 0 warning(s)
93>Build log was saved at "file://c:\\ace\\ACE_wrappers\\tests\\Debug\\Message_Queue_Notifications_Test_vc8\\BuildLog.htm"
93>Message_Queue_Notifications_Test - 0 error(s), 0 warning(s)
94>------ Build started: Project: Message_Block_Test, Configuration: Debug Win32 ------
95>------ Build started: Project: Memcpy_Test, Configuration: Debug Win32 ------
94>Compiling...
95>Compiling...
94>Message_Block_Test.cpp
95>Memcpy_Test.cpp
95>Main.cpp
95>Generating Code...
94>Main.cpp
94>Generating Code...
94>Compiling manifest to resources...
95>Compiling manifest to resources...
95>Linking...
94>Linking...
94> Creating library .\\Message_Block_Test.lib and object .\\Message_Block_Test.exp
94>Embedding manifest...
95>Embedding manifest...
95>Build log was saved at "file://c:\\ace\\ACE_wrappers\\tests\\Debug\\Memcpy_Test_vc8\\BuildLog.htm"
95>Memcpy_Test - 0 error(s), 0 warning(s)
94>Build log was saved at "file://c:\\ace\\ACE_wrappers\\tests\\Debug\\Message_Block_Test_vc8\\BuildLog.htm"
94>Message_Block_Test - 0 error(s), 0 warning(s)
96>------ Build started: Project: Mem_Map_Test, Configuration: Debug Win32 ------
96>Compiling...
96>Mem_Map_Test.cpp
96>Main.cpp
97>------ Build started: Project: Max_Default_Port_Test, Configuration: Debug Win32 ------
97>Compiling...
97>Max_Default_Port_Test.cpp
96>Generating Code...
96>Compiling manifest to resources...
96>Linking...
96> Creating library .\\Mem_Map_Test.lib and object .\\Mem_Map_Test.exp
96>Embedding manifest...
96>Build log was saved at "file://c:\\ace\\ACE_wrappers\\tests\\Debug\\Mem_Map_Test_vc8\\BuildLog.htm"
96>Mem_Map_Test - 0 error(s), 0 warning(s)
97>Main.cpp
97>Generating Code...
97>Compiling manifest to resources...
97>Linking...
98>------ Build started: Project: Max_Default_Port_Test_IPV6, Configuration: Debug Win32 ------
98>Compiling...
97>Embedding manifest...
98>Max_Default_Port_Test_IPV6.cpp
97>Build log was saved at "file://c:\\ace\\ACE_wrappers\\tests\\Debug\\Max_Default_Port_Test_vc8\\BuildLog.htm"
97>Max_Default_Port_Test - 0 error(s), 0 warning(s)
99>------ Build started: Project: Map_Test, Configuration: Debug Win32 ------
99>Compiling...
98>Main.cpp
99>Map_Test.cpp
98>Generating Code...
98>Compiling manifest to resources...
98>Linking...
98>Embedding manifest...
98>Build log was saved at "file://c:\\ace\\ACE_wrappers\\tests\\Debug\\Max_Default_Port_Test_IPV6_vc8\\BuildLog.htm"
98>Max_Default_Port_Test_IPV6 - 0 error(s), 0 warning(s)
99>Main.cpp
99>Generating Code...
100>------ Build started: Project: Map_Manager_Test, Configuration: Debug Win32 ------
99>Compiling manifest to resources...
99>Linking...
100>Compiling...
99> Creating library .\\Map_Test.lib and object .\\Map_Test.exp
100>Map_Manager_Test.cpp
99>Embedding manifest...
99>Build log was saved at "file://c:\\ace\\ACE_wrappers\\tests\\Debug\\Map_Test_vc8\\BuildLog.htm"
99>Map_Test - 0 error(s), 0 warning(s)
100>Main.cpp
101>------ Build started: Project: Manual_Event_Test, Configuration: Debug Win32 ------
101>Compiling...
101>Manual_Event_Test.cpp
100>Generating Code...
100>Compiling manifest to resources...
100>Linking...
100> Creating library .\\Map_Manager_Test.lib and object .\\Map_Manager_Test.exp
100>Embedding manifest...
101>Main.cpp
100>Build log was saved at "file://c:\\ace\\ACE_wrappers\\tests\\Debug\\Map_Manager_Test_vc8\\BuildLog.htm"
100>Map_Manager_Test - 0 error(s), 0 warning(s)
101>Generating Code...
101&

calsmurf2904
Posts: 15
Joined: Sat Oct 28, 2006 6:34 pm

Post by calsmurf2904 » Fri Nov 03, 2006 5:53 pm


calsmurf2904
Posts: 15
Joined: Sat Oct 28, 2006 6:34 pm

Post by calsmurf2904 » Fri Nov 03, 2006 5:56 pm

[list:0856f2077f]235>future1.cpp
234>Embedding manifest...
235>Compiling manifest to resources...
235>Linking...
235> Creating library .\\future1.lib and object .\\future1.exp
235>Embedding manifest...
234>Build log was saved at "file://c:\\ace\\ACE_wrappers\\examples\\Threads\\Debug\\Threads_Future2_vc8\\BuildLog.htm"
234>Threads_Future2 - 0 error(s), 0 warning(s)
235>Build log was saved at "file://c:\\ace\\ACE_wrappers\\examples\\Threads\\Debug\\Threads_Future1_vc8\\BuildLog.htm"
235>Threads_Future1 - 0 error(s), 0 warning(s)
236>------ Build started: Project: Threads_Cancel, Configuration: Debug Win32 ------
236>Compiling...
236>cancel.cpp
237>------ Build started: Project: Threads_Barrier2, Configuration: Debug Win32 ------
237>Compiling...
237>barrier2.cpp
236>Compiling manifest to resources...
236>Linking...
236>Embedding manifest...
237>Compiling manifest to resources...
237>Linking...
236>Build log was saved at "file://c:\\ace\\ACE_wrappers\\examples\\Threads\\Debug\\Threads_Cancel_vc8\\BuildLog.htm"
236>Threads_Cancel - 0 error(s), 0 warning(s)
237> Creating library .\\barrier2.lib and object .\\barrier2.exp
237>Embedding manifest...
238>------ Build started: Project: Threads_Barrier1, Configuration: Debug Win32 ------
238>Compiling...
238>barrier1.cpp
237>Build log was saved at "file://c:\\ace\\ACE_wrappers\\examples\\Threads\\Debug\\Threads_Barrier2_vc8\\BuildLog.htm"
237>Threads_Barrier2 - 0 error(s), 0 warning(s)
239>------ Build started: Project: Threads_Auto_Event, Configuration: Debug Win32 ------
239>Compiling...
239>auto_event.cpp
238>Compiling manifest to resources...
238>Linking...
238>Embedding manifest...
238>Build log was saved at "file://c:\\ace\\ACE_wrappers\\examples\\Threads\\Debug\\Threads_Barrier1_vc8\\BuildLog.htm"
238>Threads_Barrier1 - 0 error(s), 0 warning(s)
240>------ Build started: Project: Member, Configuration: Debug Win32 ------
239>Compiling manifest to resources...
239>Linking...
240>Compiling...
239> Creating library .\\auto_event.lib and object .\\auto_event.exp
240>member.cpp
239>Embedding manifest...
239>Build log was saved at "file://c:\\ace\\ACE_wrappers\\examples\\Threads\\Debug\\Threads_Auto_Event_vc8\\BuildLog.htm"
239>Threads_Auto_Event - 0 error(s), 0 warning(s)
240>.\\member.cpp(31) : warning C4244: 'argument' : conversion from 'time_t' to 'u_int', possible loss of data
240>Compiling manifest to resources...
240>Linking...
240>Embedding manifest...
240>Build log was saved at "file://c:\\ace\\ACE_wrappers\\examples\\TMCast\\Member\\Debug\\Member_vc8\\BuildLog.htm"
240>Member - 0 error(s), 1 warning(s)
241>------ Build started: Project: SV_Semaphores_2, Configuration: Debug Win32 ------
241>Compiling...
241>Semaphores_2.cpp
242>------ Build started: Project: SV_Semaphores_1, Configuration: Debug Win32 ------
242>Compiling...
242>Semaphores_1.cpp
241>Compiling manifest to resources...
241>Linking...
241>Embedding manifest...
242>Compiling manifest to resources...
242>Linking...
242>Embedding manifest...
241>Build log was saved at "file://c:\\ace\\ACE_wrappers\\examples\\System_V_IPC\\SV_Semaphores\\Debug\\SV_Semaphores_2_vc8\\BuildLog.htm"
241>SV_Semaphores_2 - 0 error(s), 0 warning(s)
242>Build log was saved at "file://c:\\ace\\ACE_wrappers\\examples\\System_V_IPC\\SV_Semaphores\\Debug\\SV_Semaphores_1_vc8\\BuildLog.htm"
242>SV_Semaphores_1 - 0 error(s), 0 warning(s)
243>------ Build started: Project: SV_Message_Queues_TMQ_Server, Configuration: Debug Win32 ------
244>------ Build started: Project: SV_Message_Queues_TMQ_Client, Configuration: Debug Win32 ------
243>Compiling...
244>Compiling...
243>TMQ_Server.cpp
244>TMQ_Client.cpp
243>Compiling manifest to resources...
244>Compiling manifest to resources...
243>Linking...
244>Linking...
244>Embedding manifest...
243>Embedding manifest...
244>Build log was saved at "file://c:\\ace\\ACE_wrappers\\examples\\System_V_IPC\\SV_Message_Queues\\Debug\\SV_Message_Queues_TMQ_Client_vc8\\BuildLog.htm"
243>Build log was saved at "file://c:\\ace\\ACE_wrappers\\examples\\System_V_IPC\\SV_Message_Queues\\Debug\\SV_Message_Queues_TMQ_Server_vc8\\BuildLog.htm"
244>SV_Message_Queues_TMQ_Client - 0 error(s), 0 warning(s)
243>SV_Message_Queues_TMQ_Server - 0 error(s), 0 warning(s)
245>------ Build started: Project: SV_Message_Queues_MQ_Server, Configuration: Debug Win32 ------
246>------ Build started: Project: SV_Message_Queues_MQ_Client, Configuration: Debug Win32 ------
245>Compiling...
246>Compiling...
245>MQ_Server.cpp
246>MQ_Client.cpp
245>Compiling manifest to resources...
245>Linking...
246>Compiling manifest to resources...
246>Linking...
245>Embedding manifest...
246>Embedding manifest...
245>Build log was saved at "file://c:\\ace\\ACE_wrappers\\examples\\System_V_IPC\\SV_Message_Queues\\Debug\\SV_Message_Queues_MQ_Server_vc8\\BuildLog.htm"
245>SV_Message_Queues_MQ_Server - 0 error(s), 0 warning(s)
247>------ Build started: Project: Synch, Configuration: Debug Win32 ------
246>Build log was saved at "file://c:\\ace\\ACE_wrappers\\examples\\System_V_IPC\\SV_Message_Queues\\Debug\\SV_Message_Queues_MQ_Client_vc8\\BuildLog.htm"
246>SV_Message_Queues_MQ_Client - 0 error(s), 0 warning(s)
247>Compiling...
247>proc_sema.cpp
248>------ Build started: Project: Smart_Pointers_Widget, Configuration: Debug Win32 ------
248>Compiling...
248>widget_test.cpp
247>Compiling manifest to resources...
247>Linking...
247>Embedding manifest...
247>Build log was saved at "file://c:\\ace\\ACE_wrappers\\examples\\Synch\\Debug\\Synch_vc8\\BuildLog.htm"
247>Synch - 0 error(s), 0 warning(s)
248>Widget_Part_Impl.cpp
249>------ Build started: Project: Smart_Pointers_Gadget, Configuration: Debug Win32 ------
249>Compiling...
249>gadget_test.cpp
248>Widget_Part_Factory.cpp
248>Widget_Part.cpp
248>Widget_Impl.cpp
249>Gadget_Part_Impl.cpp
248>Widget_Factory.cpp
248>Widget.cpp
249>Gadget_Part_Factory.cpp
248>Generating Code...
248>Compiling manifest to resources...
248>Linking...
248>Embedding manifest...
249>Gadget_Part.cpp
248>Build log was saved at "file://c:\\ace\\ACE_wrappers\\examples\\Smart_Pointers\\Debug\\Smart_Pointers_Widget_vc8\\BuildLog.htm"
248>Smart_Pointers_Widget - 0 error(s), 0 warning(s)
249>Gadget_Impl.cpp
250>------ Build started: Project: Shared_Memory_SV, Configuration: Debug Win32 ------
250>Compiling...
250>test_SV.cpp
249>Gadget_Factory.cpp
250>Compiling manifest to resources...
250>Linking...
250>Embedding manifest...
250>Build log was saved at "file://c:\\ace\\ACE_wrappers\\examples\\Shared_Memory\\Debug\\Shared_Memory_SV_vc8\\BuildLog.htm"
250>Shared_Memory_SV - 0 error(s), 0 warning(s)
249>Gadget.cpp
251>------ Build started: Project: Shared_Memory_MM, Configuration: Debug Win32 ------
251>Compiling...
251>test_MM.cpp
249>Generating Code...
249>Compiling manifest to resources...
249>Linking...
249> Creating library .\\gadget.lib and object .\\gadget.exp
249>Embedding manifest...
251>Compiling manifest to resources...
251>Linking...
251>Embedding manifest...
249>Build log was saved at "file://c:\\ace\\ACE_wrappers\\examples\\Smart_Pointers\\Debug\\Smart_Pointers_Gadget_vc8\\BuildLog.htm"
249>Smart_Pointers_Gadget - 0 error(s), 0 warning(s)
251>Build log was saved at "file://c:\\ace\\ACE_wrappers\\examples\\Shared_Memory\\Debug\\Shared_Memory_MM_vc8\\BuildLog.htm"
251>Shared_Memory_MM - 0 error(s), 0 warning(s)
252>------ Build started: Project: Shared_Malloc, Configuration: Debug Win32 ------
252>Compiling...
252>test_malloc.cpp
253>------ Build started: Project: Shared_Malloc_Posind, Configuration: Debug Win32 ------
253>Compiling...
253>test_position_independent_malloc.cpp
252>Options.cpp
253>Options.cpp
252>Malloc.cpp
253>Malloc.cpp
252>Generating Code...
252>Compiling manifest to resources...
252>Linking...
252> Creating library .\\malloc.lib and object .\\malloc.exp
253>Generating Code...
252>Embedding manifest...
253>Compiling manifest to resources...
253>Linking...
253> Creating library .\\posind.lib and object .\\posind.exp
252>Build log was saved at "file://c:\\ace\\ACE_wrappers\\examples\\Shared_Malloc\\Debug\\Shared_Malloc_vc8\\BuildLog.htm"
252>Shared_Malloc - 0 error(s), 0 warning(s)
253>Embedding manifest...
254>------ Build started: Project: Shared_Malloc_Persistence, Configuration: Debug Win32 ------
254>Compiling...
254>test_persistence.cpp
253>Build log was saved at "file://c:\\ace\\ACE_wrappers\\examples\\Shared_Malloc\\Debug\\Shared_Malloc_Posind_vc8\\BuildLog.htm"
253>Shared_Malloc_Posind - 0 error(s), 0 warning(s)
255>------ Build started: Project: Shared_Malloc_Multiple, Configuration: Debug Win32 ------
255>Compiling...
255>test_multiple_mallocs.cpp
255>Options.cpp
254>Compiling manifest to resources...
254>Linking...
254> Creating library .\\persistence.lib and object .\\persistence.exp
254>Embedding manifest...
254>Build log was saved at "file://c:\\ace\\ACE_wrappers\\examples\\Shared_Malloc\\Debug\\Shared_Malloc_Persistence_vc8\\BuildLog.htm"
254>Shared_Malloc_Persistence - 0 error(s), 0 warning(s)
255>Malloc.cpp
256>------ Build started: Project: Thread_Mutex_Test, Configuration: Debug Win32 ------
256>Compiling...
256>Thread_Mutex_Test.cpp
255>Generating Code...
255>Compiling manifest to resources...
255>Linking...
256>.\\Thread_Mutex_Test.cpp(53) : warning C4244: 'argument' : conversion from 'time_t' to 'u_int', possible loss of data
255> Creating library .\\multiple.lib and object .\\multiple.exp
256>Main.cpp
255>Embedding manifest...
256>Generating Code...
256>Compiling manifest to resources...
255>Build log was saved at "file://c:\\ace\\ACE_wrappers\\examples\\Shared_Malloc\\Debug\\Shared_Malloc_Multiple_vc8\\BuildLog.htm"
255>Shared_Malloc_Multiple - 0 error(s), 0 warning(s)
256>Linking...
256>Embedding manifest...
256>Build log was saved at "file://c:\\ace\\ACE_wrappers\\tests\\Debug\\Thread_Mutex_Test_vc8\\BuildLog.htm"
256>Thread_Mutex_Test - 0 error(s), 1 warning(s)
257>------ Build started: Project: Service_Configurator_Misc_Main, Configuration: Debug Win32 ------
257>Compiling...
257>main.cpp
258>------ Build started: Project: Svc_Cfg_IPC_Server_Test, Configuration: Debug Win32 ------
258>Compiling...
258>server_test.cpp
257>Compiling manifest to resources...
257>Linking...
257> Creating library .\\main.lib and object .\\main.exp
257>Embedding manifest...
258>Compiling manifest to resources...
258>Linking...
258>Embedding manifest...
257>Build log was saved at "file://c:\\ace\\ACE_wrappers\\examples\\Service_Configurator\\Misc\\Debug\\Service_Configurator_Misc_Main_vc8\\BuildLog.htm"
257>Service_Configurator_Misc_Main - 0 error(s), 0 warning(s)
259>------ Build started: Project: Thread_Pool_Reactor_Resume_Test, Configuration: Debug Win32 ------
258>Build log was saved at "file://c:\\ace\\ACE_wrappers\\examples\\Service_Configurator\\IPC-tests\\server\\Debug\\Svc_Cfg_IPC_Server_Test_vc8\\BuildLog.htm"
258>Svc_Cfg_IPC_Server_Test - 0 error(s), 0 warning(s)
259>Compiling...
259>Thread_Pool_Reactor_Resume_Test.cpp
260>------ Build started: Project: Svc_Cfg_IPC_Client_Rem_Thr_Stream, Configuration: Debug Win32 ------
260>Compiling...
260>remote_thr_stream_client_test.cpp
259>Main.cpp
260>Compiling manifest to resources...
260>Linking...
260>Embedding manifest...
259>Generating Code...
259>Compiling manifest to resources...
259>Linking...
259> Creating library .\\Thread_Pool_Reactor_Resume_Test.lib and object .\\Thread_Pool_Reactor_Resume_Test.exp
260>Build log was saved at "file://c:\\ace\\ACE_wrappers\\examples\\Service_Configurator\\IPC-tests\\client\\Debug\\Svc_Cfg_IPC_Client_Rem_Thr_Stream_vc8\\BuildLog.htm"
260>Svc_Cfg_IPC_Client_Rem_Thr_Stream - 0 error(s), 0 warning(s)
259>Embedding manifest...
261>------ Build started: Project: Svc_Cfg_IPC_Client_Rem_Svc_Dir, Configuration: Debug Win32 ------
261>Compiling...
261>remote_service_directory_test.cpp
259>Build log was saved at "file://c:\\ace\\ACE_wrappers\\tests\\Debug\\Thread_Pool_Reactor_Resume_Test_vc8\\BuildLog.htm"
259>Thread_Pool_Reactor_Resume_Test - 0 error(s), 0 warning(s)
262>------ Build started: Project: Svc_Cfg_IPC_Client_Rem_Stream, Configuration: Debug Win32 ------
261>Compiling manifest to resources...
261>Linking...
262>Compiling...
262>remote_stream_client_test.cpp
261>Embedding manifest...
261>Build log was saved at "file://c:\\ace\\ACE_wrappers\\examples\\Service_Configurator\\IPC-tests\\client\\Debug\\Svc_Cfg_IPC_Client_Rem_Svc_Dir_vc8\\BuildLog.htm"
261>Svc_Cfg_IPC_Client_Rem_Svc_Dir - 0 error(s), 0 warning(s)
263>------ Build started: Project: Svc_Cfg_IPC_Client_Rem_Dgram, Configuration: Debug Win32 ------
263>Compiling...
262>Compiling manifest to resources...
263>remote_dgram_client_test.cpp
262>Linking...
262>Embedding manifest...
262>Build log was saved at "file://c:\\ace\\ACE_wrappers\\examples\\Service_Configurator\\IPC-tests\\client\\Debug\\Svc_Cfg_IPC_Client_Rem_Stream_vc8\\BuildLog.htm"
262>Svc_Cfg_IPC_Client_Rem_Stream - 0 error(s), 0 warning(s)
264>------ Build started: Project: Svc_Cfg_IPC_Client_Loc_Stream, Configuration: Debug Win32 ------
263>Compiling manifest to resources...
263>Linking...
264>Compiling...
264>local_stream_client_test.cpp
263>Embedding manifest...
263>Build log was saved at "file://c:\\ace\\ACE_wrappers\\examples\\Service_Configurator\\IPC-tests\\client\\Debug\\Svc_Cfg_IPC_Client_Rem_Dgram_vc8\\BuildLog.htm"
263>Svc_Cfg_IPC_Client_Rem_Dgram - 0 error(s), 0 warning(s)
265>------ Build started: Project: Svc_Cfg_IPC_Client_Loc_Spipe, Configuration: Debug Win32 ------
265>Compiling...
265>local_spipe_client_test.cpp
264>Compiling manifest to resources...
264>Linking...
264>Embedding manifest...
264>Build log was saved at "file://c:\\ace\\ACE_wrappers\\examples\\Service_Configurator\\IPC-tests\\client\\Debug\\Svc_Cfg_IPC_Client_Loc_Stream_vc8\\BuildLog.htm"
264>Svc_Cfg_IPC_Client_Loc_Stream - 0 error(s), 0 warning(s)
266>------ Build started: Project: Svc_Cfg_IPC_Client_Loc_Pipe, Configuration: Debug Win32 ------
265>Compiling manifest to resources...
265>Linking...
266>Compiling...
266>local_pipe_client_test.cpp
265>Embedding manifest...
265>Build log was saved at "file://c:\\ace\\ACE_wrappers\\examples\\Service_Configurator\\IPC-tests\\client\\Debug\\Svc_Cfg_IPC_Client_Loc_Spipe_vc8\\BuildLog.htm"
265>Svc_Cfg_IPC_Client_Loc_Spipe - 0 error(s), 0 warning(s)
267>------ Build started: Project: Svc_Cfg_IPC_Client_Loc_Fifo, Configuration: Debug Win32 ------
266>Compiling manifest to resources...
266>Linking...
267>Compiling...
267>local_fifo_client_test.cpp
266>Embedding manifest...
266>Build log was saved at "file://c:\\ace\\ACE_wrappers\\examples\\Service_Configurator\\IPC-tests\\client\\Debug\\Svc_Cfg_IPC_Client_Loc_Pipe_vc8\\BuildLog.htm"
266>Svc_Cfg_IPC_Client_Loc_Pipe - 0 error(s), 0 warning(s)
268>------ Build started: Project: Svc_Cfg_IPC_Client_Loc_Dgram, Configuration: Debug Win32 ------
267>Compiling manifest to resources...
267>Linking...
268>Compiling...
268>local_dgram_client_test.cpp
267>Embedding manifest...
267>Build log was saved at "file://c:\\ace\\ACE_wrappers\\examples\\Service_Configurator\\IPC-tests\\client\\Debug\\Svc_Cfg_IPC_Client_Loc_Fifo_vc8\\BuildLog.htm"
267>Svc_Cfg_IPC_Client_Loc_Fifo - 0 error(s), 0 warning(s)
269>------ Build started: Project: Svc_Cfg_IPC_Client_Bcast, Configuration: Debug Win32 ------
268>Compiling manifest to resources...
268>Linking...
269>Compiling...
269>broadcast_client_test.cpp
268>Embedding manifest...
268>Build log was saved at "file://c:\\ace\\ACE_wrappers\\examples\\Service_Configurator\\IPC-tests\\client\\Debug\\Svc_Cfg_IPC_Client_Loc_Dgram_vc8\\BuildLog.htm"
268>Svc_Cfg_IPC_Client_Loc_Dgram - 0 error(s), 0 warning(s)
270>------ Build started: Project: Registry_Update, Configuration: Debug Win32 ------
270>Compiling...
269>Compiling manifest to resources...
269>Linking...
270>test_registry_update.cpp
269>Embedding manifest...
269>Build log was saved at "file://c:\\ace\\ACE_wrappers\\examples\\Service_Configurator\\IPC-tests\\client\\Debug\\Svc_Cfg_IPC_Client_Bcast_vc8\\BuildLog.htm"
269>Svc_Cfg_IPC_Client_Bcast - 0 error(s), 0 warning(s)
271>------ Build started: Project: Registry_Iterator, Configuration: Debug Win32 ------
271>Compiling...
271>test_registry_iterator.cpp
270>Compiling manifest to resources...
270>Linking...
270>Embedding manifest...
270>Build log was saved at "file://c:\\ace\\ACE_wrappers\\examples\\Registry\\Debug\\Registry_Update_vc8\\BuildLog.htm"
270>Registry_Update - 0 error(s), 0 warning(s)
272>------ Build started: Project: WFMO_Reactor_Window_Messages, Configuration: Debug Win32 ------
271>Compiling manifest to resources...
271>Linking...
272>Compiling...
272>Window_Messages.cpp
271>Embedding manifest...
271>Build log was saved at "file://c:\\ace\\ACE_wrappers\\examples\\Registry\\Debug\\Registry_Iterator_vc8\\BuildLog.htm"
271>Registry_Iterator - 0 error(s), 0 warning(s)
273>------ Build started: Project: WFMO_Reactor_Timeouts, Configuration: Debug Win32 ------
273>Compiling...
273>Timeouts.cpp
272>Compiling manifest to resources...
272>Linking...
272>Embedding manifest...
272>Build log was saved at "file://c:\\ace\\ACE_wrappers\\examples\\Reactor\\WFMO_Reactor\\Debug\\WFMO_Reactor_Window_Messages_vc8\\BuildLog.htm"
272>WFMO_Reactor_Window_Messages - 0 error(s), 0 warning(s)
273>Compiling manifest to resources...
273>Linking...
273>Embedding manifest...
274>------ Build started: Project: WFMO_Reactor_Talker, Configuration: Debug Win32 ------
274>Compiling...
274>Talker.cpp
273>Build log was saved at "file://c:\\ace\\ACE_wrappers\\examples\\Reactor\\WFMO_Reactor\\Debug\\WFMO_Reactor_Timeouts_vc8\\BuildLog.htm"
273>WFMO_Reactor_Timeouts - 0 error(s), 0 warning(s)
275>------ Build started: Project: WFMO_Reactor_Suspended_Removals, Configuration: Debug Win32 ------
275>Compiling...
275>Suspended_Removals.cpp
274>Compiling manifest to resources...
274>Linking...
274>Embedding manifest...
275>Compiling manifest to resources...
275>Linking...
274>Build log was saved at "file://c:\\ace\\ACE_wrappers\\examples\\Reactor\\WFMO_Reactor\\Debug\\WFMO_Reactor_Talker_vc8\\BuildLog.htm"
274>WFMO_Reactor_Talker - 0 error(s), 0 warning(s)
275>Embedding manifest...
276>------ Build started: Project: WFMO_Reactor_Removals, Configuration: Debug Win32 ------
275>Build log was saved at "file://c:\\ace\\ACE_wrappers\\examples\\Reactor\\WFMO_Reactor\\Debug\\WFMO_Reactor_Suspended_Removals_vc8\\BuildLog.htm"
275>WFMO_Reactor_Suspended_Removals - 0 error(s), 0 warning(s)
276>Compiling...
276>Removals.cpp
277>------ Build started: Project: WFMO_Reactor_Registry_Changes, Configuration: Debug Win32 ------
277>Compiling...
277>Registry_Changes.cpp
276>Compiling manifest to resources...
276>Linking...
276>Embedding manifest...
277>Compiling manifest to resources...
277>Linking...
276>Build log was saved at "file://c:\\ace\\ACE_wrappers\\examples\\Reactor\\WFMO_Reactor\\Debug\\WFMO_Reactor_Removals_vc8\\BuildLog.htm"
276>WFMO_Reactor_Removals - 0 error(s), 0 warning(s)
277>Embedding manifest...
278>------ Build started: Project: WFMO_Reactor_Registration, Configuration: Debug Win32 ------
278>Compiling...
278>Registration.cpp
277>Build log was saved at "file://c:\\ace\\ACE_wrappers\\examples\\Reactor\\WFMO_Reactor\\Debug\\WFMO_Reactor_Registry_Changes_vc8\\BuildLog.htm"
277>WFMO_Reactor_Registry_Changes - 0 error(s), 0 warning(s)
279>------ Build started: Project: WFMO_Reactor_Prerun_State_Changes, Configuration: Debug Win32 ------
279>Compiling...
279>Prerun_State_Changes.cpp
278>Compiling manifest to resources...
278>Linking...
278>Embedding manifest...
278>Build log was saved at "file://c:\\ace\\ACE_wrappers\\examples\\Reactor\\WFMO_Reactor\\Debug\\WFMO_Reactor_Registration_vc8\\BuildLog.htm"
278>WFMO_Reactor_Registration - 0 error(s), 0 warning(s)
280>------ Build started: Project: WFMO_Reactor_Network_Events, Configuration: Debug Win32 ------
279>Compiling manifest to resources...
279>Linking...
280>Compiling...
280>Network_Events.cpp
279>Embedding manifest...
279>Build log was saved at "file://c:\\ace\\ACE_wrappers\\examples\\Reactor\\WFMO_Reactor\\Debug\\WFMO_Reactor_Prerun_State_Changes_vc8\\BuildLog.htm"
279>WFMO_Reactor_Prerun_State_Changes - 0 error(s), 0 warning(s)
281>------ Build started: Project: WFMO_Reactor_Multithreading, Configuration: Debug Win32 ------
281>Compiling...
281>Multithreading.cpp
280>Compiling manifest to resources...
280>Linking...
280> Creating library .\\network_events.lib and object .\\network_events.exp
280>Embedding manifest...
280>Build log was saved at "file://c:\\ace\\ACE_wrappers\\examples\\Reactor\\WFMO_Reactor\\Debug\\WFMO_Reactor_Network_Events_vc8\\BuildLog.htm"
280>WFMO_Reactor_Network_Events - 0 error(s), 0 warning(s)
281>.\\Multithreading.cpp(215) : warning C4244: 'argument' : conversion from 'time_t' to 'u_int', possible loss of data
282>------ Build started: Project: WFMO_Reactor_Handle_Close, Configuration: Debug Win32 ------
281>Compiling manifest to resources...
281>Linking...
282>Compiling...
281> Creating library .\\multithreading.lib and object .\\multithreading.exp
282>Handle_Close.cpp
281>Embedding manifest...
281>Build log was saved at "file://c:\\ace\\ACE_wrappers\\examples\\Reactor\\WFMO_Reactor\\Debug\\WFMO_Reactor_Multithreading_vc8\\BuildLog.htm"
281>WFMO_Reactor_Multithreading - 0 error(s), 1 warning(s)
283>------ Build started: Project: WFMO_Reactor_Exceptions, Configuration: Debug Win32 ------
283>Compiling...
283>Exceptions.cpp
282>Compiling manifest to resources...
282>Linking...
282> Creating library .\\handle_close.lib and object .\\handle_close.exp
283>Compiling manifest to resources...
283>Linking...
283>Embedding manifest...
282>Embedding manifest...
283>Build log was saved at "file://c:\\ace\\ACE_wrappers\\examples\\Reactor\\WFMO_Reactor\\Debug\\WFMO_Reactor_Exceptions_vc8\\BuildLog.htm"
283>WFMO_Reactor_Exceptions - 0 error(s), 0 warning(s)
282>Build log was saved at "file://c:\\ace\\ACE_wrappers\\examples\\Reactor\\WFMO_Reactor\\Debug\\WFMO_Reactor_Handle_Close_vc8\\BuildLog.htm"
282>WFMO_Reactor_Handle_Close - 0 error(s), 0 warning(s)
284>------ Build started: Project: WFMO_Reactor_Directory_Changes, Configuration: Debug Win32 ------
284>Compiling...
284>Directory_Changes.cpp
285>------ Build started: Project: WFMO_Reactor_Console_Input, Configuration: Debug Win32 ------
285>Compiling...
285>Console_Input.cpp
284>Compiling manifest to resources...
284>Linking...
284>Embedding manifest...
284>Build log was saved at "file://c:\\ace\\ACE_wrappers\\examples\\Reactor\\WFMO_Reactor\\Debug\\WFMO_Reactor_Directory_Changes_vc8\\BuildLog.htm"
284>WFMO_Reactor_Directory_Changes - 0 error(s), 0 warning(s)
286>------ Build started: Project: WFMO_Reactor_Abandoned, Configuration: Debug Win32 ------
286>Compiling...
285>Compiling manifest to resources...
285>Linking...
286>Abandoned.cpp
285>Embedding manifest...
285>Build log was saved at "file://c:\\ace\\ACE_wrappers\\examples\\Reactor\\WFMO_Reactor\\Debug\\WFMO_Reactor_Console_Input_vc8\\BuildLog.htm"
285>WFMO_Reactor_Console_Input - 0 error(s), 0 warning(s)
287>------ Build started: Project: WFMO_Reactor_APC, Configuration: Debug Win32 ------
287>Compiling...
286>Compiling manifest to resources...
286>Linking...
287>APC.cpp
286> Creating library .\\abandoned.lib and object .\\abandoned.exp
286>Embedding manifest...
286>Build log was saved at "file://c:\\ace\\ACE_wrappers\\examples\\Reactor\\WFMO_Reactor\\Debug\\WFMO_Reactor_Abandoned_vc8\\BuildLog.htm"
286>WFMO_Reactor_Abandoned - 0 error(s), 0 warning(s)
288>------ Build started: Project: TP_Reactor_Server, Configuration: Debug Win32 ------
287>Compiling manifest to resources...
287>Linking...
288>Compiling...
288>server.cpp
287>Embedding manifest...
287>Build log was saved at "file://c:\\ace\\ACE_wrappers\\examples\\Reactor\\WFMO_Reactor\\Debug\\WFMO_Reactor_APC_vc8\\BuildLog.htm"
287>WFMO_Reactor_APC - 0 error(s), 0 warning(s)
289>------ Build started: Project: TP_Reactor_Client, Configuration: Debug Win32 ------
289>Compiling...
289>client.cpp
288>ReadHandler.cpp
289>Compiling manifest to resources...
289>Linking...
289> Creating library .\\client.lib and object .\\client.exp
289>Embedding manifest...
289>Build log was saved at "file://c:\\ace\\ACE_wrappers\\examples\\Reactor\\TP_Reactor\\Debug\\TP_Reactor_Client_vc8\\BuildLog.htm"
289>TP_Reactor_Client - 0 error(s), 0 warning(s)
288>AcceptHandler.cpp
290>------ Build started: Project: Proactor_Udp_Proactor, Configuration: Debug Win32 ------
290>Compiling...
290>test_udp_proactor.cpp
288>Generating Code...
288>Compiling manifest to resources...
288>Linking...
288> Creating library .\\server.lib and object .\\server.exp
288>Embedding manifest...
288>Build log was saved at "file://c:\\ace\\ACE_wrappers\\examples\\Reactor\\TP_Reactor\\Debug\\TP_Reactor_Server_vc8\\BuildLog.htm"
288>TP_Reactor_Server - 0 error(s), 0 warning(s)
290>Compiling manifest to resources...
290>Linking...
290> Creating library .\\test_udp_proactor.lib and object .\\test_udp_proactor.exp
291>------ Build started: Project: Proactor_Timeout, Configuration: Debug Win32 ------
290>Embedding manifest...
291>Compiling...
291>test_timeout.cpp
290>Build log was saved at "file://c:\\ace\\ACE_wrappers\\examples\\Reactor\\Proactor\\Debug\\Proactor_Udp_Proactor_vc8\\BuildLog.htm"
290>Proactor_Udp_Proactor - 0 error(s), 0 warning(s)
292>------ Build started: Project: Proactor_Proactor, Configuration: Debug Win32 ------
292>Compiling...
292>test_proactor.cpp
291>Compiling manifest to resources...
291>Linking...
291>Embedding manifest...
291>Build log was saved at "file://c:\\ace\\ACE_wrappers\\examples\\Reactor\\Proactor\\Debug\\Proactor_Timeout_vc8\\BuildLog.htm"
291>Proactor_Timeout - 0 error(s), 0 warning(s)
292>.\\test_proactor.cpp(383) : warning C4244: '=' : conversion from 'ACE_LOFF_T' to 'u_long', possible loss of data
292>Compiling manifest to resources...
292>Linking...
292> Creating library .\\test_proactor.lib and object .\\test_proactor.exp
292>Embedding manifest...
293>------ Build started: Project: Proactor_Post_Completions, Configuration: Debug Win32 ------
292>Build log was saved at "file://c:\\ace\\ACE_wrappers\\examples\\Reactor\\Proactor\\Debug\\Proactor_Proactor_vc8\\BuildLog.htm"
292>Proactor_Proactor - 0 error(s), 1 warning(s)
294>------ Build started: Project: Proactor_Multiple_Loops, Configuration: Debug Win32 ------
293>Compiling...
294>Compiling...
293>post_completions.cpp
294>test_multiple_loops.cpp
293>Compiling manifest to resources...
293>Linking...
294>Compiling manifest to resources...
294>Linking...
293> Creating library .\\test_post_completions.lib and object .\\test_post_completions.exp
293>Embedding manifest...
294>Embedding manifest...
293>Build log was saved at "file://c:\\ace\\ACE_wrappers\\examples\\Reactor\\Proactor\\Debug\\Proactor_Post_Completions_vc8\\BuildLog.htm"
293>Proactor_Post_Completions - 0 error(s), 0 warning(s)
295>------ Build started: Project: Proactor_End_Event_Loops, Configuration: Debug Win32 ------
294>Build log was saved at "file://c:\\ace\\ACE_wrappers\\examples\\Reactor\\Proactor\\Debug\\Proactor_Multiple_Loops_vc8\\BuildLog.htm"
294>Proactor_Multiple_Loops - 0 error(s), 0 warning(s)
295>Compiling...
295>test_end_event_loop.cpp
296>------ Build started: Project: Thread_Pool_Reactor_Test, Configuration: Debug Win32 ------
296>Compiling...
296>Thread_Pool_Reactor_Test.cpp
295>Compiling manifest to resources...
295>Linking...
295>Embedding manifest...
296>Main.cpp
295>Build log was saved at "file://c:\\ace\\ACE_wrappers\\examples\\Reactor\\Proactor\\Debug\\Proactor_End_Event_Loops_vc8\\BuildLog.htm"
295>Proactor_End_Event_Loops - 0 error(s), 0 warning(s)
296>Generating Code...
296>Compiling manifest to resources...
296>Linking...
296> Creating library .\\Thread_Pool_Reactor_Test.lib and object .\\Thread_Pool_Reactor_Test.exp
296>Embedding manifest...
297>------ Build started: Project: Reactor_Ntalker, Configuration: Debug Win32 ------
296>Build log was saved at "file://c:\\ace\\ACE_wrappers\\tests\\Debug\\Thread_Pool_Reactor_Test_vc8\\BuildLog.htm"
296>Thread_Pool_Reactor_Test - 0 error(s), 0 warning(s)
297>Compiling...
297>ntalker.cpp
298>------ Build started: Project: Reactor_Multicast_Server, Configuration: Debug Win32 ------
298>Compiling...
297>Compiling manifest to resources...
297>Linking...
298>server.cpp
297>Embedding manifest...
297>Build log was saved at "file://c:\\ace\\ACE_wrappers\\examples\\Reactor\\Ntalker\\Debug\\Reactor_Ntalker_vc8\\BuildLog.htm"
297>Reactor_Ntalker - 0 error(s), 0 warning(s)
299>------ Build started: Project: Reactor_Multicast_Client, Configuration: Debug Win32 ------
299>Compiling...
299>Log_Wrapper.cpp
298>Log_Wrapper.cpp
298>.\\Log_Wrapper.cpp(66) : warning C4244: '=' : conversion from 'time_t' to 'long', possible loss of data
299>.\\Log_Wrapper.cpp(66) : warning C4244: '=' : conversion from 'time_t' to 'long', possible loss of data
298>Generating Code...
299>client.cpp
298>Compiling manifest to resources...
298>Linking...
298>Embedding manifest...
298>Build log was saved at "file://c:\\ace\\ACE_wrappers\\examples\\Reactor\\Multicast\\Debug\\Reactor_Multicast_Server_vc8\\BuildLog.htm"
298>Reactor_Multicast_Server - 0 error(s), 1 warning(s)
299>Generating Code...
300>------ Build started: Project: Reactor_Misc_Timer_Queue, Configuration: Debug Win32 ------
299>Compiling manifest to resources...
299>Linking...
300>Compiling...
299> Creating library .\\client.lib and object .\\client.exp
300>test_timer_queue.cpp
299>Embedding manifest...
299>Build log was saved at "file://c:\\ace\\ACE_wrappers\\examples\\Reactor\\Multicast\\Debug\\Reactor_Multicast_Client_vc8\\BuildLog.htm"
299>Reactor_Multicast_Client - 0 error(s), 1 warning(s)
301>------ Build started: Project: Reactor_Misc_Signals_2, Configuration: Debug Win32 ------
301>Compiling...
301>test_signals_2.cpp
300>Compiling manifest to resources...
300>Linking...
300> Creating library .\\timer_queue.lib and object .\\timer_queue.exp
300>Embedding manifest...
300>Build log was saved at "file://c:\\ace\\ACE_wrappers\\examples\\Reactor\\Misc\\Debug\\Reactor_Misc_Timer_Queue_vc8\\BuildLog.htm"
300>Reactor_Misc_Timer_Queue - 0 error(s), 0 warning(s)
302>------ Build started: Project: Reactor_Misc_Signals_1, Configuration: Debug Win32 ------
301>Compiling manifest to resources...
301>Linking...
302>Compiling...
302>test_signals_1.cpp
301>Embedding manifest...
301>Build log was saved at "file://c:\\ace\\ACE_wrappers\\examples\\Reactor\\Misc\\Debug\\Reactor_Misc_Signals_2_vc8\\BuildLog.htm"
301>Reactor_Misc_Signals_2 - 0 error(s), 0 warning(s)
303>------ Build started: Project: Reactor_Misc_Reactors, Configuration: Debug Win32 ------
303>Compiling...
302>Compiling manifest to resources...
302>Linking...
303>test_reactors.cpp
302>Embedding manifest...
302>Build log was saved at "file://c:\\ace\\ACE_wrappers\\examples\\Reactor\\Misc\\Debug\\Reactor_Misc_Signals_1_vc8\\BuildLog.htm"
302>Reactor_Misc_Signals_1 - 0 error(s), 0 warning(s)
304>------ Build started: Project: Reactor_Misc_Pingpong, Configuration: Debug Win32 ------
304>Compiling...
304>pingpong.cpp
303>Compiling manifest to resources...
303>Linking...
303>Embedding manifest...
304>Compiling manifest to resources...
304>Linking...
304> Creating library .\\pingpong.lib and object .\\pingpong.exp
303>Build log was saved at "file://c:\\ace\\ACE_wrappers\\examples\\Reactor\\Misc\\Debug\\Reactor_Misc_Reactors_vc8\\BuildLog.htm"
303>Reactor_Misc_Reactors - 0 error(s), 0 warning(s)
304>Embedding manifest...
305>------ Build started: Project: Reactor_Misc_Notification, Configuration: Debug Win32 ------
305>Compiling...
305>notification.cpp
304>Build log was saved at "file://c:\\ace\\ACE_wrappers\\examples\\Reactor\\Misc\\Debug\\Reactor_Misc_Pingpong_vc8\\BuildLog.htm"
304>Reactor_Misc_Pingpong - 0 error(s), 0 warning(s)
305>.\\notification.cpp(241) : warning C4244: 'argument' : conversion from 'time_t' to 'suseconds_t', possible loss of data
306>------ Build started: Project: Reactor_Misc_Event_Handler_t, Configuration: Debug Win32 ------
305>Compiling manifest to resources...
306>Compiling...
305>Linking...
306>test_event_handler_t.cpp
305> Creating library .\\notification.lib and object .\\notification.exp
305>Embedding manifest...
305>Build log was saved at "file://c:\\ace\\ACE_wrappers\\examples\\Reactor\\Misc\\Debug\\Reactor_Misc_Notification_vc8\\BuildLog.htm"
305>Reactor_Misc_Notification - 0 error(s), 1 warning(s)
307>------ Build started: Project: Reactor_Misc_Early_Timeouts, Configuration: Debug Win32 ------
306>Compiling manifest to resources...
306>Linking...
307>Compiling...
307>test_early_timeouts.cpp
306>Embedding manifest...
306>Build log was saved at "file://c:\\ace\\ACE_wrappers\\examples\\Reactor\\Misc\\Debug\\Reactor_Misc_Event_Handler_t_vc8\\BuildLog.htm"
306>Reactor_Misc_Event_Handler_t - 0 error(s), 0 warning(s)
308>------ Build started: Project: Reactor_Misc_Demuxing, Configuration: Debug Win32 ------
307>Compiling manifest to resources...
307>Linking...
308>Compiling...
308>test_demuxing.cpp
307>Embedding manifest...
307>Build log was saved at "file://c:\\ace\\ACE_wrappers\\examples\\Reactor\\Misc\\Debug\\Reactor_Misc_Early_Timeouts_vc8\\BuildLog.htm"
307>Reactor_Misc_Early_Timeouts - 0 error(s), 0 warning(s)
309>------ Build started: Project: Reactor_FIFO_Server, Configuration: Debug Win32 ------
309>Compiling...
309>server.cpp
308>Compiling manifest to resources...
308>Linking...
308> Creating library .\\demuxing.lib and object .\\demuxing.exp
308>Embedding manifest...
308>Build log was saved at "file://c:\\ace\\ACE_wrappers\\examples\\Reactor\\Misc\\Debug\\Reactor_Misc_Demuxing_vc8\\BuildLog.htm"
308>Reactor_Misc_Demuxing - 0 error(s), 0 warning(s)
309>Compiling manifest to resources...
309>Linking...
309>Embedding manifest...
310>------ Build started: Project: Reactor_FIFO_Client, Configuration: Debug Win32 ------
310>Compiling...
309>Build log was saved at "file://c:\\ace\\ACE_wrappers\\examples\\Reactor\\FIFO\\Debug\\Reactor_FIFO_Server_vc8\\BuildLog.htm"
309>Reactor_FIFO_Server - 0 error(s), 0 warning(s)
310>client.cpp
311>------ Build started: Project: Reactor_Dgram, Configuration: Debug Win32 ------
310>Compiling manifest to resources...
310>Linking...
311>Compiling...
311>Dgram.cpp
310>Embedding manifest...
310>Build log was saved at "file://c:\\ace\\ACE_wrappers\\examples\\Reactor\\FIFO\\Debug\\Reactor_FIFO_Client_vc8\\BuildLog.htm"
310>Reactor_FIFO_Client - 0 error(s), 0 warning(s)
312>------ Build started: Project: Reactor_Dgram_CO, Configuration: Debug Win32 ------
311>Compiling manifest to resources...
311>Linking...
312>Compiling...
311> Creating library .\\dgram.lib and object .\\dgram.exp
312>CODgram.cpp
311>Embedding manifest...
311>Build log was saved at "file://c:\\ace\\ACE_wrappers\\examples\\Reactor\\Dgram\\Debug\\Reactor_Dgram_vc8\\BuildLog.htm"
311>Reactor_Dgram - 0 error(s), 0 warning(s)
313>------ Build started: Project: QOS_Simple_Sender, Configuration: Debug Win32 ------
313>Compiling...
313>Sender_QoS_Event_Handler.cpp
312>Compiling manifest to resources...
312>Linking...
312>Embedding manifest...
312>Build log was saved at "file://c:\\ace\\ACE_wrappers\\examples\\Reactor\\Dgram\\Debug\\Reactor_Dgram_CO_vc8\\BuildLog.htm"
312>Reactor_Dgram_CO - 0 error(s), 0 warning(s)
313>sender.cpp
314>------ Build started: Project: QOS_Simple_Receiver, Configuration: Debug Win32 ------
314>Compiling...
314>Receiver_QoS_Event_Handler.cpp
314>receiver.cpp
313>QoS_Util.cpp
313>QoS_Signal_Handler.cpp
314>QoS_Util.cpp
313>Fill_ACE_QoS.cpp
314>QoS_Signal_Handler.cpp
313>Generating Code...
314>Fill_ACE_QoS.cpp
313>Compiling manifest to resources...
313>Linking...
313> Creating library .\\sender.lib and object .\\sender.exp
313>Embedding manifest...
313>Build log was saved at "file://c:\\ace\\ACE_wrappers\\examples\\QOS\\Simple\\Debug\\QOS_Simple_Sender_vc8\\BuildLog.htm"
313>QOS_Simple_Sender - 0 error(s), 0 warning(s)
314>Generating Code...
314>Compiling manifest to resources...
314>Linking...
314> Creating library .\\receiver.lib and object .\\receiver.exp
314>Embedding manifest...
315>------ Build started: Project: QOS_Diffserv_Server, Configuration: Debug Win32 ------
315>Compiling...
315>server.cpp
314>LINK : fatal error LNK1123: failure during conversion to COFF: file invalid or corrupt
314>Build log was saved at "file://c:\\ace\\ACE_wrappers\\examples\\QOS\\Simple\\Debug\\QOS_Simple_Receiver_vc8\\BuildLog.htm"
314>QOS_Simple_Receiver - 1 error(s), 0 warning(s)
316>------ Build started: Project: QOS_Diffserv_Client, Configuration: Debug Win32 ------
315>Compiling manifest to resources...
315>Linking...
316>Compiling...
315> Creating library .\\server.lib and object .\\server.exp
316>diffserv_test.cpp
315>Embedding manifest...
315>Build log was saved at "file://c:\\ace\\ACE_wrappers\\examples\\QOS\\Diffserv\\Debug\\QOS_Diffserv_Server_vc8\\BuildLog.htm"
315>QOS_Diffserv_Server - 0 error(s), 0 warning(s)
317>------ Build started: Project: QOS_Change_Sender_TSpec_Sender, Configuration: Debug Win32 ------
316>Compiling manifest to resources...
316>Linking...
317>Compiling...
317>Sender_QoS_Event_Handler.cpp
316>Embedding manifest...
316>Build log was saved at "file://c:\\ace\\ACE_wrappers\\examples\\QOS\\Diffserv\\Debug\\QOS_Diffserv_Client_vc8\\BuildLog.htm"
316>QOS_Diffserv_Client - 0 error(s), 0 warning(s)
318>------ Build started: Project: QOS_Change_Sender_TSpec_Receiver, Configuration: Debug Win32 ------
318>Compiling...
317>sender.cpp
318>Receiver_QoS_Event_Handler.cpp
317>QoS_Util.cpp
318>receiver.cpp
317>QoS_Signal_Handler.cpp
318>QoS_Util.cpp
317>Fill_ACE_QoS.cpp
318>QoS_Signal_Handler.cpp
317>Generating Code...
317>Compiling manifest to resources...
317>Linking...
317> Creating library .\\sender.lib and object .\\sender.exp
318>Fill_ACE_QoS.cpp
317>Embedding manifest...
317>Build log was saved at "file://c:\\ace\\ACE_wrappers\\examples\\QOS\\Change_Sender_TSpec\\Debug\\QOS_Change_Sender_TSpec_Sender_vc8\\BuildLog.htm"
317>QOS_Change_Sender_TSpec_Sender - 0 error(s), 0 warning(s)
318>Generating Code...
319>------ Build started: Project: QOS_Change_Receiver_FlowSpec_Sender, Configuration: Debug Win32 ------
318>Compiling manifest to resources...
318>Linking...
319>Compiling...
318> Creating library .\\receiver.lib and object .\\receiver.exp
319>Sender_QoS_Event_Handler.cpp
318>Embedding manifest...
318>Build log was saved at "file://c:\\ace\\ACE_wrappers\\examples\\QOS\\Change_Sender_TSpec\\Debug\\QOS_Change_Sender_TSpec_Receiver_vc8\\BuildLog.htm"
318>QOS_Change_Sender_TSpec_Receiver - 0 error(s), 0 warning(s)
319>sender.cpp
320>------ Build started: Project: QOS_Change_Receiver_FlowSpec_Receiver, Configuration: Debug Win32 ------
320>Compiling...
320>Receiver_QoS_Event_Handler.cpp
319>QoS_Util.cpp
319>QoS_Signal_Handler.cpp
320>receiver.cpp
319>Fill_ACE_QoS.cpp
320>QoS_Util.cpp
319>Generating Code...
319>Compiling manifest to resources...
319>Linking...
320>QoS_Signal_Handler.cpp
319> Creating library .\\sender.lib and object .\\sender.exp
319>Embedding manifest...
319>Build log was saved at "file://c:\\ace\\ACE_wrappers\\examples\\QOS\\Change_Receiver_FlowSpec\\Debug\\QOS_Change_Receiver_FlowSpec_Sender_vc8\\BuildLog.htm"
319>QOS_Change_Receiver_FlowSpec_Sender - 0 error(s), 0 warning(s)
320>Fill_ACE_QoS.cpp
320>Generating Code...
321>------ Build started: Project: OS_Process_Process, Configuration: Debug Win32 ------
321>Compiling...
321>process.cpp
320>Compiling manifest to resources...
320>Linking...
320> Creating library .\\receiver.lib and object .\\receiver.exp
320>Embedding manifest...
320>Build log was saved at "file://c:\\ace\\ACE_wrappers\\examples\\QOS\\Change_Receiver_FlowSpec\\Debug\\QOS_Change_Receiver_FlowSpec_Receiver_vc8\\BuildLog.htm"
320>QOS_Change_Receiver_FlowSpec_Receiver - 0 error(s), 0 warning(s)
321>Compiling manifest to resources...
321>Linking...
321>Embedding manifest...
321>Build log was saved at "file://c:\\ace\\ACE_wrappers\\examples\\OS\\Process\\Debug\\OS_Process_Process_vc8\\BuildLog.htm"
321>OS_Process_Process - 0 error(s), 0 warning(s)
322>------ Build started: Project: OS_Process_Imore, Configuration: Debug Win32 ------
323>------ Build started: Project: Naming_Writers, Configuration: Debug Win32 ------
323>Compiling...
322>Compiling...
322>imore.cpp
323>test_writers.cpp
322>Compiling manifest to resources...
323>Compiling manifest to resources...
322>Linking...
323>Linking...
323> Creating library .\\writers.lib and object .\\writers.exp
323>Embedding manifest...
322>Embedding manifest...
322>Build log was saved at "file://c:\\ace\\ACE_wrappers\\examples\\OS\\Process\\Debug\\OS_Process_Imore_vc8\\BuildLog.htm"
322>OS_Process_Imore - 0 error(s), 0 warning(s)
323>Build log was saved at "file://c:\\ace\\ACE_wrappers\\examples\\Naming\\Debug\\Naming_Writers_vc8\\BuildLog.htm"
323>Naming_Writers - 0 error(s), 0 warning(s)
324>------ Build started: Project: Naming_Open, Configuration: Debug Win32 ------
324>Compiling...
324>test_open.cpp
325>------ Build started: Project: Naming_Non_Existent, Configuration: Debug Win32 ------
325>Compiling...
325>test_non_existent.cpp
324>Compiling manifest to resources...
324>Linking...
324>Embedding manifest...
324>Build log was saved at "file://c:\\ace\\ACE_wrappers\\examples\\Naming\\Debug\\Naming_Open_vc8\\BuildLog.htm"
324>Naming_Open - 0 error(s), 0 warning(s)
325>Compiling manifest to resources...
325>Linking...
325> Creating library .\\non_existent.lib and object .\\non_existent.exp
325>Embedding manifest...
326>------ Build started: Project: Naming_Multiple_Contexts, Configuration: Debug Win32 ------
326>Compiling...
325>Build log was saved at "file://c:\\ace\\ACE_wrappers\\examples\\Naming\\Debug\\Naming_Non_Existent_vc8\\BuildLog.htm"
325>Naming_Non_Existent - 0 error(s), 0 warning(s)
326>test_multiple_contexts.cpp
327>------ Build started: Project: NT_Service, Configuration: Debug Win32 ------
327>Compiling...
327>ntsvc.cpp
326>Compiling manifest to resources...
326>Linking...
326> Creating library .\\multiple_contexts.lib and object .\\multiple_contexts.exp
326>Embedding manifest...
326>Build log was saved at "file://c:\\ace\\ACE_wrappers\\examples\\Naming\\Debug\\Naming_Multiple_Contexts_vc8\\BuildLog.htm"
326>Naming_Multiple_Contexts - 0 error(s), 0 warning(s)
327>main.cpp
328>------ Build started: Project: Misc_Test_Trace, Configuration: Debug Win32 ------
328>Compiling...
328>test_trace.cpp
328>Compiling manifest to resources...
328>Linking...
327>Generating Code...
328>Embedding manifest...
327>Compiling manifest to resources...
327>Linking...
327> Creating library .\\main.lib and object .\\main.exp
328>Build log was saved at "file://c:\\ace\\ACE_wrappers\\examples\\Misc\\Debug\\Misc_Test_Trace_vc8\\BuildLog.htm"
328>Misc_Test_Trace - 0 error(s), 0 warning(s)
327>Embedding manifest...
329>------ Build started: Project: Misc_Test_Timestamp, Configuration: Debug Win32 ------
329>Compiling...
329>test_timestamp.cpp
327>Build log was saved at "file://c:\\ace\\ACE_wrappers\\examples\\NT_Service\\Debug\\NT_Service_vc8\\BuildLog.htm"
327>NT_Service - 0 error(s), 0 warning(s)
329>Compiling manifest to resources...
329>Linking...
330>------ Build started: Project: Misc_Test_Sstring, Configuration: Debug Win32 ------
330>Compiling...
329>Embedding manifest...
330>test_sstring.cpp
329>Build log was saved at "file://c:\\ace\\ACE_wrappers\\examples\\Misc\\Debug\\Misc_Test_Timestamp_vc8\\BuildLog.htm"
329>Misc_Test_Timestamp - 0 error(s), 0 warning(s)
331>------ Build started: Project: Misc_Test_Set, Configuration: Debug Win32 ------
330>Compiling manifest to resources...
330>Linking...
331>Compiling...
331>test_set.cpp
330>Embedding manifest...
330>Build log was saved at "file://c:\\ace\\ACE_wrappers\\examples\\Misc\\Debug\\Misc_Test_Sstring_vc8\\BuildLog.htm"
330>Misc_Test_Sstring - 0 error(s), 0 warning(s)
332>------ Build started: Project: Misc_Test_Read_Buffer, Configuration: Debug Win32 ------
331>Compiling manifest to resources...
332>Compiling...
331>Linking...
332>test_read_buffer.cpp
331>Embedding manifest...
331>Build log was saved at "file://c:\\ace\\ACE_wrappers\\examples\\Misc\\Debug\\Misc_Test_Set_vc8\\BuildLog.htm"
331>Misc_Test_Set - 0 error(s), 0 warning(s)
333>------ Build started: Project: Misc_Test_Profile_Timer, Configuration: Debug Win32 ------
332>Compiling manifest to resources...
332>Linking...
333>Compiling...
333>test_profile_timer.cpp
332>Embedding manifest...
332>Build log was saved at "file://c:\\ace\\ACE_wrappers\\examples\\Misc\\Debug\\Misc_Test_Read_Buffer_vc8\\BuildLog.htm"
332>Misc_Test_Read_Buffer - 0 error(s), 0 warning(s)
334>------ Build started: Project: Misc_Test_Get_Opt, Configuration: Debug Win32 ------
333>Compiling manifest to resources...
333>Linking...
334>Compiling...
334>test_get_opt.cpp
333>Embedding manifest...
333>Build log was saved at "file://c:\\ace\\ACE_wrappers\\examples\\Misc\\Debug\\Misc_Test_Profile_Timer_vc8\\BuildLog.htm"
333>Misc_Test_Profile_Timer - 0 error(s), 0 warning(s)
335>------ Build started: Project: Misc_Test_Dump, Configuration: Debug Win32 ------
334>Compiling manifest to resources...
334>Linking...
335>Compiling...
335>test_dump.cpp
334>Embedding manifest...
334>Build log was saved at "file://c:\\ace\\ACE_wrappers\\examples\\Misc\\Debug\\Misc_Test_Get_Opt_vc8\\BuildLog.htm"
334>Misc_Test_Get_Opt - 0 error(s), 0 warning(s)
336>------ Build started: Project: Mem_Map_File_Reverse, Configuration: Debug Win32 ------
335>Compiling manifest to resources...
335>Linking...
336>Compiling...
336>file-reverse.cpp
335>Embedding manifest...
335>Build log was saved at "file://c:\\ace\\ACE_wrappers\\examples\\Misc\\Debug\\Misc_Test_Dump_vc8\\BuildLog.htm"
335>Misc_Test_Dump - 0 error(s), 0 warning(s)
336>Compiling manifest to resources...
336>Linking...
337>------ Build started: Project: Mem_Map_IO_Tests, Configuration: Debug Win32 ------
336>Embedding manifest...
337>Compiling...
337>test_io.cpp
336>Build log was saved at "file://c:\\ace\\ACE_wrappers\\examples\\Mem_Map\\file-reverse\\Debug\\Mem_Map_File_Reverse_vc8\\BuildLog.htm"
336>Mem_Map_File_Reverse - 0 error(s), 0 warning(s)
337>IO_Test.cpp
337>Generating Code...
337>Compiling manifest to resources...
337>Linking...
337>Embedding manifest...
337>Build log was saved at "file://c:\\ace\\ACE_wrappers\\examples\\Mem_Map\\IO-tests\\Debug\\Mem_Map_IO_Tests_vc8\\BuildLog.htm"
337>Mem_Map_IO_Tests - 0 error(s), 0 warning(s)
338>------ Build started: Project: Map_Manager, Configuration: Debug Win32 ------
338>Compiling...
338>test_hash_map_manager.cpp
339>------ Build started: Project: Logger_Simple_Server, Configuration: Debug Win32 ------
339>Compiling...
339>server_loggerd.cpp
338>Compiling manifest to resources...
338>Linking...
339>Logging_Handler.cpp
338>Embedding manifest...
338>Build log was saved at "file://c:\\ace\\ACE_wrappers\\examples\\Map_Manager\\Debug\\Map_Manager_vc8\\BuildLog.htm"
338>Map_Manager - 0 error(s), 0 warning(s)
340>------ Build started: Project: Logger_client, Configuration: Debug Win32 ------
340>Compiling...
340>logging_app.cpp
339>Logging_Acceptor.cpp
340>.\\logging_app.cpp(38) : warning C4244: 'argument' : conversion from 'time_t' to 'long', possible loss of data
340>Compiling manifest to resources...
340>Linking...
340>Embedding manifest...
339>Generating Code...
339>Compiling manifest to resources...
339>Linking...
340>Build log was saved at "file://c:\\ace\\ACE_wrappers\\examples\\Logger\\client\\Debug\\Logger_client_vc8\\BuildLog.htm"
340>Logger_client - 0 error(s), 1 warning(s)
339> Creating library .\\server_loggerd.lib and object .\\server_loggerd.exp
339>Embedding manifest...
339>Build log was saved at "file://c:\\ace\\ACE_wrappers\\examples\\Logger\\simple-server\\Debug\\Logger_Simple_Server_vc8\\BuildLog.htm"
339>Logger_Simple_Server - 0 error(s), 0 warning(s)
341>------ Build started: Project: Logger_Acceptor_Server, Configuration: Debug Win32 ------
341>Compiling...
341>server_loggerd.cpp
342>------ Build started: Project: Log_Msg_Test_Ostream, Configuration: Debug Win32 ------
342>Compiling...
342>test_ostream.cpp
342>Compiling manifest to resources...
342>Linking...
342>Embedding manifest...
341>Compiling manifest to resources...
341>Linking...
341> Creating library .\\server_loggerd.lib and object .\\server_loggerd.exp
342>Build log was saved at "file://c:\\ace\\ACE_wrappers\\examples\\Log_Msg\\Debug\\Log_Msg_Test_Ostream_vc8\\BuildLog.htm"
342>Log_Msg_Test_Ostream - 0 error(s), 0 warning(s)
343>------ Build started: Project: Log_Msg_Test_Log_Msg, Configuration: Debug Win32 ------
343>Compiling...
341>Embedding manifest...
343>test_log_msg.cpp
341>Build log was saved at "file://c:\\ace\\ACE_wrappers\\examples\\Logger\\Acceptor-server\\Debug\\Logger_Acceptor_Server_vc8\\BuildLog.htm"
341>Logger_Acceptor_Server - 0 error(s), 0 warning(s)
344>------ Build started: Project: Log_Msg_Test_Callback, Configuration: Debug Win32 ------
344>Compiling...
344>test_callback.cpp
343>Compiling manifest to resources...
343>Linking...
344>Compiling manifest to resources...
344>Linking...
343>Embedding manifest...
344>Embedding manifest...
343>Build log was saved at "file://c:\\ace\\ACE_wrappers\\examples\\Log_Msg\\Debug\\Log_Msg_Test_Log_Msg_vc8\\BuildLog.htm"
343>Log_Msg_Test_Log_Msg - 0 error(s), 0 warning(s)
344>Build log was saved at "file://c:\\ace\\ACE_wrappers\\examples\\Log_Msg\\Debug\\Log_Msg_Test_Callback_vc8\\BuildLog.htm"
344>Log_Msg_Test_Callback - 0 error(s), 0 warning(s)
345>------ Build started: Project: UPIPE_SAP_Ex3, Configuration: Debug Win32 ------
345>Compiling...
345>ex3.cpp
346>------ Build started: Project: UPIPE_SAP_Ex2, Configuration: Debug Win32 ------
346>Compiling...
346>ex2.cpp
345>Compiling manifest to resources...
345>Linking...
346>Compiling manifest to resources...
345>Embedding manifest...
346>Linking...
346> Creating library .\\ex2.lib and object .\\ex2.exp
346>Embedding manifest...
345>Build log was saved at "file://c:\\ace\\ACE_wrappers\\examples\\IPC_SAP\\UPIPE_SAP\\Debug\\UPIPE_SAP_Ex3_vc8\\BuildLog.htm"
345>UPIPE_SAP_Ex3 - 0 error(s), 0 warning(s)
346>Build log was saved at "file://c:\\ace\\ACE_wrappers\\examples\\IPC_SAP\\UPIPE_SAP\\Debug\\UPIPE_SAP_Ex2_vc8\\BuildLog.htm"
346>UPIPE_SAP_Ex2 - 0 error(s), 0 warning(s)
347>------ Build started: Project: UPIPE_SAP_Ex1, Configuration: Debug Win32 ------
347>Compiling...
347>ex1.cpp
348>------ Build started: Project: TLI_SAP_Ftp_Server, Configuration: Debug Win32 ------
348>Compiling...
348>ftp-server.cpp
348>Compiling manifest to resources...
348>Linking...
347>Compiling manifest to resources...
347>Linking...
348>Embedding manifest...
347> Creating library .\\ex1.lib and object .\\ex1.exp
347>Embedding manifest...
348>Build log was saved at "file://c:\\ace\\ACE_wrappers\\examples\\IPC_SAP\\TLI_SAP\\Debug\\TLI_SAP_Ftp_Server_vc8\\BuildLog.htm"
348>TLI_SAP_Ftp_Server - 0 error(s), 0 warning(s)
347>Build log was saved at "file://c:\\ace\\ACE_wrappers\\examples\\IPC_SAP\\UPIPE_SAP\\Debug\\UPIPE_SAP_Ex1_vc8\\BuildLog.htm"
347>UPIPE_SAP_Ex1 - 0 error(s), 0 warning(s)
349>------ Build started: Project: TLI_SAP_Ftp_Client, Configuration: Debug Win32 ------
350>------ Build started: Project: TLI_SAP_Db_Server, Configuration: Debug Win32 ------
350>Compiling...
349>Compiling...
350>db-server.cpp
349>ftp-client.cpp
349>Compiling manifest to resources...
349>Linking...
349>Embedding manifest...
350>Compiling manifest to resources...
350>Linking...
350>Embedding manifest...
349>Build log was saved at "file://c:\\ace\\ACE_wrappers\\examples\\IPC_SAP\\TLI_SAP\\Debug\\TLI_SAP_Ftp_Client_vc8\\BuildLog.htm"
349>TLI_SAP_Ftp_Client - 0 error(s), 0 warning(s)
351>------ Build started: Project: TLI_SAP_Db_Client, Configuration: Debug Win32 ------
350>Build log was saved at "file://c:\\ace\\ACE_wrappers\\examples\\IPC_SAP\\TLI_SAP\\Debug\\TLI_SAP_Db_Server_vc8\\BuildLog.htm"
350>TLI_SAP_Db_Server - 0 error(s), 0 warning(s)
351>Compiling...
351>db-client.cpp
352>------ Build started: Project: TLI_SAP_CPP_Server, Configuration: Debug Win32 ------
351>Compiling manifest to resources...
351>Linking...
352>Compiling...
352>CPP-server.cpp
351>Embedding manifest...
351>Build log was saved at "file://c:\\ace\\ACE_wrappers\\examples\\IPC_SAP\\TLI_SAP\\Debug\\TLI_SAP_Db_Client_vc8\\BuildLog.htm"
351>TLI_SAP_Db_Client - 0 error(s), 0 warning(s)
353>------ Build started: Project: TLI_SAP_CPP_Client, Configuration: Debug Win32 ------
352>Compiling manifest to resources...
352>Linking...
353>Compiling...
353>CPP-client.cpp
352>Embedding manifest...
352>Build log was saved at "file://c:\\ace\\ACE_wrappers\\examples\\IPC_SAP\\TLI_SAP\\Debug\\TLI_SAP_CPP_Server_vc8\\BuildLog.htm"
352>TLI_SAP_CPP_Server - 0 error(s), 0 warning(s)
354>------ Build started: Project: TLI_SAP_ATM_Server, Configuration: Debug Win32 ------
354>Compiling...
354>CPP-ATM-server.cpp
353>Compiling manifest to resources...
353>Linking...
353>Embedding manifest...
353>Build log was saved at "file://c:\\ace\\ACE_wrappers\\examples\\IPC_SAP\\TLI_SAP\\Debug\\TLI_SAP_CPP_Client_vc8\\BuildLog.htm"
353>TLI_SAP_CPP_Client - 0 error(s), 0 warning(s)
354>Compiling manifest to resources...
354>Linking...
355>------ Build started: Project: TLI_SAP_ATM_Client, Configuration: Debug Win32 ------
354>Embedding manifest...
355>Compiling...
355>CPP-ATM-client.cpp
354>Build log was saved at "file://c:\\ace\\ACE_wrappers\\examples\\IPC_SAP\\TLI_SAP\\Debug\\TLI_SAP_ATM_Server_vc8\\BuildLog.htm"
354>TLI_SAP_ATM_Server - 0 error(s), 0 warning(s)
356>------ Build started: Project: SPIPE_SAP_Server, Configuration: Debug Win32 ------
356>Compiling...
356>server.cpp
355>Compiling manifest to resources...
355>Linking...
355>Embedding manifest...
355>Build log was saved at "file://c:\\ace\\ACE_wrappers\\examples\\IPC_SAP\\TLI_SAP\\Debug\\TLI_SAP_ATM_Client_vc8\\BuildLog.htm"
355>TLI_SAP_ATM_Client - 0 error(s), 0 warning(s)
356>Compiling manifest to resources...
356>Linking...
357>------ Build started: Project: SPIPE_SAP_Producer_Read, Configuration: Debug Win32 ------
357>Compiling...
356>Embedding manifest...
357>producer_read.cpp
356>Build log was saved at "file://c:\\ace\\ACE_wrappers\\examples\\IPC_SAP\\SPIPE_SAP\\Debug\\SPIPE_SAP_Server_vc8\\BuildLog.htm"
356>SPIPE_SAP_Server - 0 error(s), 0 warning(s)
358>------ Build started: Project: SPIPE_SAP_Producer_Msg, Configuration: Debug Win32 ------
358>Compiling...
358>producer_msg.cpp
357>Compiling manifest to resources...
357>Linking...
357>Embedding manifest...
357>Build log was saved at "file://c:\\ace\\ACE_wrappers\\examples\\IPC_SAP\\SPIPE_SAP\\Debug\\SPIPE_SAP_Producer_Read_vc8\\BuildLog.htm"
357>SPIPE_SAP_Producer_Read - 0 error(s), 0 warning(s)
358>Compiling manifest to resources...
358>Linking...
358>Embedding manifest...
359>------ Build started: Project: SPIPE_SAP_NPServer, Configuration: Debug Win32 ------
359>Compiling...
359>NPServer.cpp
358>Build log was saved at "file://c:\\ace\\ACE_wrappers\\examples\\IPC_SAP\\SPIPE_SAP\\Debug\\SPIPE_SAP_Producer_Msg_vc8\\BuildLog.htm"
358>SPIPE_SAP_Producer_Msg - 0 error(s), 0 warning(s)
360>------ Build started: Project: SPIPE_SAP_NPClient, Configuration: Debug Win32 ------
359>Compiling manifest to resources...
359>Linking...
360>Compiling...
360>NPClient.cpp
359>Embedding manifest...
359>Build log was saved at "file://c:\\ace\\ACE_wrappers\\examples\\IPC_SAP\\SPIPE_SAP\\Debug\\SPIPE_SAP_NPServer_vc8\\BuildLog.htm"
359>SPIPE_SAP_NPServer - 0 error(s), 0 warning(s)
361>------ Build started: Project: SPIPE_SAP_Consumer_Read, Configuration: Debug Win32 ------
360>Compiling manifest to resources...
360>Linking...
361>Compiling...
360> Creating library .\\NPClient.lib and object .\\NPClient.exp
361>consumer_read.cpp
360>Embedding manifest...
360>Build log was saved at "file://c:\\ace\\ACE_wrappers\\examples\\IPC_SAP\\SPIPE_SAP\\Debug\\SPIPE_SAP_NPClient_vc8\\BuildLog.htm"
360>SPIPE_SAP_NPClient - 0 error(s), 0 warning(s)
362>------ Build started: Project: SPIPE_SAP_Consumer_Msg, Configuration: Debug Win32 ------
361>Compiling manifest to resources...
361>Linking...
362>Compiling...
362>consumer_msg.cpp
361>Embedding manifest...
361>Build log was saved at "file://c:\\ace\\ACE_wrappers\\examples\\IPC_SAP\\SPIPE_SAP\\Debug\\SPIPE_SAP_Consumer_Read_vc8\\BuildLog.htm"
361>SPIPE_SAP_Consumer_Read - 0 error(s), 0 warning(s)
363>------ Build started: Project: SPIPE_SAP_Client, Configuration: Debug Win32 ------
362>Compiling manifest to resources...
362>Linking...
363>Compiling...
363>client.cpp
362>Embedding manifest...
362>Build log was saved at "file://c:\\ace\\ACE_wrappers\\examples\\IPC_SAP\\SPIPE_SAP\\Debug\\SPIPE_SAP_Consumer_Msg_vc8\\BuildLog.htm"
362>SPIPE_SAP_Consumer_Msg - 0 error(s), 0 warning(s)
364>------ Build started: Project: Sock_Sap_FD_Unclient, Configuration: Debug Win32 ------
363>Compiling manifest to resources...
363>Linking...
364>Compiling...
364>FD-unclient.cpp
363>Embedding manifest...
363>Build log was saved at "file://c:\\ace\\ACE_wrappers\\examples\\IPC_SAP\\SPIPE_SAP\\Debug\\SPIPE_SAP_Client_vc8\\BuildLog.htm"
363>SPIPE_SAP_Client - 0 error(s), 0 warning(s)
364>Compiling manifest to resources...
364>Linking...
364>Embedding manifest...
364>Build log was saved at "file://c:\\ace\\ACE_wrappers\\examples\\IPC_SAP\\SOCK_SAP\\Debug\\Sock_Sap_FD_Unclient_vc8\\BuildLog.htm"
364>Sock_Sap_FD_Unclient - 0 error(s), 0 warning(s)
365>------ Build started: Project: Sock_Sap_C_Inserver, Configuration: Debug Win32 ------
365>Compiling...
365>C-inserver.cpp
366>------ Build started: Project: Sock_Sap_C_Inclient, Configuration: Debug Win32 ------
366>Compiling...
366>C-inclient.cpp
365>Compiling manifest to resources...
365>Linking...
365>Embedding manifest...
366>Compiling manifest to resources...
366>Linking...
365>Build log was saved at "file://c:\\ace\\ACE_wrappers\\examples\\IPC_SAP\\SOCK_SAP\\Debug\\Sock_Sap_C_Inserver_vc8\\BuildLog.htm"
365>Sock_Sap_C_Inserver - 0 error(s), 0 warning(s)
366>Embedding manifest...
366>Build log was saved at "file://c:\\ace\\ACE_wrappers\\examples\\IPC_SAP\\SOCK_SAP\\Debug\\Sock_Sap_C_Inclient_vc8\\BuildLog.htm"
366>Sock_Sap_C_Inclient - 0 error(s), 0 warning(s)
367>------ Build started: Project: Sock_Sap_CPP_Unserver, Configuration: Debug Win32 ------
367>Compiling...
367>CPP-unserver.cpp
368>------ Build started: Project: Sock_Sap_CPP_Unclient, Configuration: Debug Win32 ------
368>Compiling...
368>CPP-unclient.cpp
367>Compiling manifest to resources...
367>Linking...
368>Compiling manifest to resources...
368>Linking...
367>Embedding manifest...
368>Embedding manifest...
367>Build log was saved at "file://c:\\ace\\ACE_wrappers\\examples\\IPC_SAP\\SOCK_SAP\\Debug\\Sock_Sap_CPP_Unserver_vc8\\BuildLog.htm"
367>Sock_Sap_CPP_Unserver - 0 error(s), 0 warning(s)
368>Build log was saved at "file://c:\\ace\\ACE_wrappers\\examples\\IPC_SAP\\SOCK_SAP\\Debug\\Sock_Sap_CPP_Unclient_vc8\\BuildLog.htm"
368>Sock_Sap_CPP_Unclient - 0 error(s), 0 warning(s)
369>------ Build started: Project: Sock_Sap_CPP_Memserver, Configuration: Debug Win32 ------
369>Compiling...
369>CPP-memserver.cpp
370>------ Build started: Project: Sock_Sap_CPP_Memclient, Configuration: Debug Win32 ------
370>Compiling...
370>CPP-memclient.cpp
369>Compiling manifest to resources...
369>Linking...
370>Compiling manifest to resources...
370>Linking...
369>Embedding manifest...
370>Embedding manifest...
369>Build log was saved at "file://c:\\ace\\ACE_wrappers\\examples\\IPC_SAP\\SOCK_SAP\\Debug\\Sock_Sap_CPP_Memserver_vc8\\BuildLog.htm"
369>Sock_Sap_CPP_Memserver - 0 error(s), 0 warning(s)
371>------ Build started: Project: Sock_Sap_CPP_Inserver, Configuration: Debug Win32 ------
370>Build log was saved at "file://c:\\ace\\ACE_wrappers\\examples\\IPC_SAP\\SOCK_SAP\\Debug\\Sock_Sap_CPP_Memclient_vc8\\BuildLog.htm"
370>Sock_Sap_CPP_Memclient - 0 error(s), 0 warning(s)
371>Compiling...
371>CPP-inserver.cpp
372>------ Build started: Project: Sock_Sap_CPP_Inclient, Configuration: Debug Win32 ------
371>Compiling manifest to resources...
371>Linking...
372>Compiling...
371> Creating library .\\CPP-inserver.lib and object .\\CPP-inserver.exp
372>CPP-inclient.cpp
371>Embedding manifest...
371>Build log was saved at "file://c:\\ace\\ACE_wrappers\\examples\\IPC_SAP\\SOCK_SAP\\Debug\\Sock_Sap_CPP_Inserver_vc8\\BuildLog.htm"
371>Sock_Sap_CPP_Inserver - 0 error(s), 0 warning(s)
373>------ B

calsmurf2904
Posts: 15
Joined: Sat Oct 28, 2006 6:34 pm

Post by calsmurf2904 » Fri Nov 03, 2006 6:00 pm

[list:1a8eccde37]507>Build log was saved at "file://c:\\ace\\ACE_wrappers\\examples\\APG\\Logging\\Debug\\Use_Logging_Strategy_vc8\\BuildLog.htm"
507>Use_Logging_Strategy - 0 error(s), 0 warning(s)
508>Compiling manifest to resources...
508>Linking...
508>Embedding manifest...
508>Build log was saved at "file://c:\\ace\\ACE_wrappers\\examples\\APG\\Logging\\Debug\\Use_Logging_Server_vc8\\BuildLog.htm"
508>Use_Logging_Server - 0 error(s), 0 warning(s)
509>------ Build started: Project: Use_Logger, Configuration: Debug Win32 ------
509>Compiling...
509>Use_Logger.cpp
510>------ Build started: Project: Use_LogManager, Configuration: Debug Win32 ------
510>Compiling...
510>Use_LogManager.cpp
509>Compiling manifest to resources...
509>Linking...
509>Embedding manifest...
509>Build log was saved at "file://c:\\ace\\ACE_wrappers\\examples\\APG\\Logging\\Debug\\Use_Logger_vc8\\BuildLog.htm"
509>Use_Logger - 0 error(s), 0 warning(s)
511>------ Build started: Project: Use_Callback, Configuration: Debug Win32 ------
510>Compiling manifest to resources...
510>Linking...
511>Compiling...
510> Creating library .\\Use_LogManager.lib and object .\\Use_LogManager.exp
511>Use_Callback.cpp
510>Embedding manifest...
510>Build log was saved at "file://c:\\ace\\ACE_wrappers\\examples\\APG\\Logging\\Debug\\Use_LogManager_vc8\\BuildLog.htm"
510>Use_LogManager - 0 error(s), 0 warning(s)
512>------ Build started: Project: Use_Callback2, Configuration: Debug Win32 ------
511>Compiling manifest to resources...
511>Linking...
512>Compiling...
512>Use_Callback2.cpp
511>Embedding manifest...
511>Build log was saved at "file://c:\\ace\\ACE_wrappers\\examples\\APG\\Logging\\Debug\\Use_Callback_vc8\\BuildLog.htm"
511>Use_Callback - 0 error(s), 0 warning(s)
513>------ Build started: Project: Trace_Return, Configuration: Debug Win32 ------
513>Compiling...
513>Trace_Return.cpp
513>Compiling manifest to resources...
513>Linking...
512>Compiling manifest to resources...
512>Linking...
513>Embedding manifest...
512>Embedding manifest...
513>Build log was saved at "file://c:\\ace\\ACE_wrappers\\examples\\APG\\Logging\\Debug\\Trace_Return_vc8\\BuildLog.htm"
513>Trace_Return - 0 error(s), 0 warning(s)
512>Build log was saved at "file://c:\\ace\\ACE_wrappers\\examples\\APG\\Logging\\Debug\\Use_Callback2_vc8\\BuildLog.htm"
512>Use_Callback2 - 0 error(s), 0 warning(s)
514>------ Build started: Project: Simple2, Configuration: Debug Win32 ------
514>Compiling...
514>Simple2.cpp
515>------ Build started: Project: Simple1, Configuration: Debug Win32 ------
515>Compiling...
515>Simple1.cpp
514>Compiling manifest to resources...
514>Linking...
514>Embedding manifest...
515>Compiling manifest to resources...
515>Linking...
515>Embedding manifest...
514>Build log was saved at "file://c:\\ace\\ACE_wrappers\\examples\\APG\\Logging\\Debug\\Simple2_vc8\\BuildLog.htm"
514>Simple2 - 0 error(s), 0 warning(s)
515>Build log was saved at "file://c:\\ace\\ACE_wrappers\\examples\\APG\\Logging\\Debug\\Simple1_vc8\\BuildLog.htm"
515>Simple1 - 0 error(s), 0 warning(s)
516>------ Build started: Project: Howto_Syslog, Configuration: Debug Win32 ------
516>Compiling...
516>Howto_Syslog.cpp
517>------ Build started: Project: Change_Mask, Configuration: Debug Win32 ------
517>Compiling...
517>Change_Mask.cpp
516>Compiling manifest to resources...
516>Linking...
516>Embedding manifest...
517>Compiling manifest to resources...
517>Linking...
516>Build log was saved at "file://c:\\ace\\ACE_wrappers\\examples\\APG\\Logging\\Debug\\Howto_Syslog_vc8\\BuildLog.htm"
516>Howto_Syslog - 0 error(s), 0 warning(s)
517>Embedding manifest...
517>Build log was saved at "file://c:\\ace\\ACE_wrappers\\examples\\APG\\Logging\\Debug\\Change_Mask_vc8\\BuildLog.htm"
517>Change_Mask - 0 error(s), 0 warning(s)
518>------ Build started: Project: Change_Instance_Default, Configuration: Debug Win32 ------
518>Compiling...
518>Change_Instance_Default.cpp
519>------ Build started: Project: Stacks, Configuration: Debug Win32 ------
519>Compiling...
519>Stacks.cpp
518>Compiling manifest to resources...
518>Linking...
519>Compiling manifest to resources...
519>Linking...
518>Embedding manifest...
519> Creating library .\\Stacks.lib and object .\\Stacks.exp
519>Embedding manifest...
518>Build log was saved at "file://c:\\ace\\ACE_wrappers\\examples\\APG\\Logging\\Debug\\Change_Instance_Default_vc8\\BuildLog.htm"
518>Change_Instance_Default - 0 error(s), 0 warning(s)
519>Build log was saved at "file://c:\\ace\\ACE_wrappers\\examples\\APG\\Containers\\Debug\\Stacks_vc8\\BuildLog.htm"
519>Stacks - 0 error(s), 0 warning(s)
520>------ Build started: Project: Sets, Configuration: Debug Win32 ------
521>------ Build started: Project: RB_Tree, Configuration: Debug Win32 ------
520>Compiling...
521>Compiling...
520>Sets.cpp
521>RB_Tree.cpp
520>Compiling manifest to resources...
520>Linking...
520> Creating library .\\Sets.lib and object .\\Sets.exp
520>Embedding manifest...
520>Build log was saved at "file://c:\\ace\\ACE_wrappers\\examples\\APG\\Containers\\Debug\\Sets_vc8\\BuildLog.htm"
520>Sets - 0 error(s), 0 warning(s)
521>Compiling manifest to resources...
521>Linking...
521> Creating library .\\RB_Tree.lib and object .\\RB_Tree.exp
521>Embedding manifest...
522>------ Build started: Project: RB_Tree_Functors, Configuration: Debug Win32 ------
522>Compiling...
522>RB_Tree_Functors.cpp
522>Compiling manifest to resources...
522>Linking...
522> Creating library .\\RB_Tree_Functors.lib and object .\\RB_Tree_Functors.exp
521>Build log was saved at "file://c:\\ace\\ACE_wrappers\\examples\\APG\\Containers\\Debug\\RB_Tree_vc8\\BuildLog.htm"
521>RB_Tree - 0 error(s), 0 warning(s)
522>Embedding manifest...
523>------ Build started: Project: Queues, Configuration: Debug Win32 ------
523>Compiling...
522>Build log was saved at "file://c:\\ace\\ACE_wrappers\\examples\\APG\\Containers\\Debug\\RB_Tree_Functors_vc8\\BuildLog.htm"
522>RB_Tree_Functors - 0 error(s), 0 warning(s)
523>Queues.cpp
524>------ Build started: Project: Map_Manager_Specialization, Configuration: Debug Win32 ------
524>Compiling...
524>Map_Manager_Specialization.cpp
523>Compiling manifest to resources...
523>Linking...
523> Creating library .\\Queues.lib and object .\\Queues.exp
523>Embedding manifest...
523>Build log was saved at "file://c:\\ace\\ACE_wrappers\\examples\\APG\\Containers\\Debug\\Queues_vc8\\BuildLog.htm"
523>Queues - 0 error(s), 0 warning(s)
525>------ Build started: Project: Hash_Map_Hash, Configuration: Debug Win32 ------
524>Compiling manifest to resources...
524>Linking...
525>Compiling...
525>Hash_Map_Hash.cpp
524>Embedding manifest...
524>Build log was saved at "file://c:\\ace\\ACE_wrappers\\examples\\APG\\Containers\\Debug\\Map_Manager_Specialization_vc8\\BuildLog.htm"
524>Map_Manager_Specialization - 0 error(s), 0 warning(s)
526>------ Build started: Project: DLList, Configuration: Debug Win32 ------
525>Compiling manifest to resources...
525>Linking...
526>Compiling...
526>DLList.cpp
525>Embedding manifest...
525>Build log was saved at "file://c:\\ace\\ACE_wrappers\\examples\\APG\\Containers\\Debug\\Hash_Map_Hash_vc8\\BuildLog.htm"
525>Hash_Map_Hash - 0 error(s), 0 warning(s)
527>------ Build started: Project: Containers_Map_Manager, Configuration: Debug Win32 ------
526>Compiling manifest to resources...
526>Linking...
527>Compiling...
526> Creating library .\\DLList.lib and object .\\DLList.exp
527>Map_Manager.cpp
526>Embedding manifest...
526>Build log was saved at "file://c:\\ace\\ACE_wrappers\\examples\\APG\\Containers\\Debug\\DLList_vc8\\BuildLog.htm"
526>DLList - 0 error(s), 0 warning(s)
528>------ Build started: Project: Containers_Hash_Map, Configuration: Debug Win32 ------
527>Compiling manifest to resources...
527>Linking...
528>Compiling...
528>Hash_Map.cpp
527>Embedding manifest...
527>Build log was saved at "file://c:\\ace\\ACE_wrappers\\examples\\APG\\Containers\\Debug\\Containers_Map_Manager_vc8\\BuildLog.htm"
527>Containers_Map_Manager - 0 error(s), 0 warning(s)
529>------ Build started: Project: Array, Configuration: Debug Win32 ------
529>Compiling...
529>Array.cpp
528>Compiling manifest to resources...
528>Linking...
528>Embedding manifest...
529>Compiling manifest to resources...
529>Linking...
529> Creating library .\\Array.lib and object .\\Array.exp
528>Build log was saved at "file://c:\\ace\\ACE_wrappers\\examples\\APG\\Containers\\Debug\\Containers_Hash_Map_vc8\\BuildLog.htm"
528>Containers_Hash_Map - 0 error(s), 0 warning(s)
529>Embedding manifest...
529>Build log was saved at "file://c:\\ace\\ACE_wrappers\\examples\\APG\\Containers\\Debug\\Array_vc8\\BuildLog.htm"
529>Array - 0 error(s), 0 warning(s)
530>------ Build started: Project: Allocator, Configuration: Debug Win32 ------
531>------ Build started: Project: Get_Opt, Configuration: Debug Win32 ------
531>Compiling...
530>Compiling...
530>Allocator.cpp
531>Get_Opt.cpp
531>Compiling manifest to resources...
530>Compiling manifest to resources...
530>Linking...
531>Linking...
530> Creating library .\\Allocator.lib and object .\\Allocator.exp
531>Embedding manifest...
530>Embedding manifest...
531>Build log was saved at "file://c:\\ace\\ACE_wrappers\\examples\\APG\\Config\\Debug\\Get_Opt_vc8\\BuildLog.htm"
531>Get_Opt - 0 error(s), 0 warning(s)
530>Build log was saved at "file://c:\\ace\\ACE_wrappers\\examples\\APG\\Containers\\Debug\\Allocator_vc8\\BuildLog.htm"
530>Allocator - 0 error(s), 0 warning(s)
532>------ Build started: Project: Get_Opt_Long, Configuration: Debug Win32 ------
532>Compiling...
532>Get_Opt_Long.cpp
533>------ Build started: Project: Config_HA_Status, Configuration: Debug Win32 ------
532>Compiling manifest to resources...
532>Linking...
533>Compiling...
533>HA_Status.cpp
532>Embedding manifest...
532>Build log was saved at "file://c:\\ace\\ACE_wrappers\\examples\\APG\\Config\\Debug\\Get_Opt_Long_vc8\\BuildLog.htm"
532>Get_Opt_Long - 0 error(s), 0 warning(s)
534>------ Build started: Project: ARGV_Example, Configuration: Debug Win32 ------
534>Compiling...
534>ARGV_Example.cpp
533>Compiling manifest to resources...
533>Linking...
533>Embedding manifest...
533>Build log was saved at "file://c:\\ace\\ACE_wrappers\\examples\\APG\\Config\\Debug\\Config_HA_Status_vc8\\BuildLog.htm"
533>Config_HA_Status - 0 error(s), 0 warning(s)
534>Compiling manifest to resources...
534>Linking...
534> Creating library .\\ARGV_Example.lib and object .\\ARGV_Example.exp
534>Embedding manifest...
534>Build log was saved at "file://c:\\ace\\ACE_wrappers\\examples\\APG\\Config\\Debug\\ARGV_Example_vc8\\BuildLog.htm"
534>ARGV_Example - 0 error(s), 0 warning(s)
535>------ Build started: Project: AO, Configuration: Debug Win32 ------
536>------ Build started: Project: AO2, Configuration: Debug Win32 ------
535>Compiling...
536>Compiling...
535>AO.cpp
536>AO2.cpp
535>Compiling manifest to resources...
536>Compiling manifest to resources...
535>Linking...
536>Linking...
535> Creating library .\\AO.lib and object .\\AO.exp
536> Creating library .\\AO2.lib and object .\\AO2.exp
535>Embedding manifest...
536>Embedding manifest...
535>Build log was saved at "file://c:\\ace\\ACE_wrappers\\examples\\APG\\Active_Objects\\Debug\\AO_vc8\\BuildLog.htm"
535>AO - 0 error(s), 0 warning(s)
537>------ Build started: Project: soreduce, Configuration: Debug Win32 ------
536>Build log was saved at "file://c:\\ace\\ACE_wrappers\\examples\\APG\\Active_Objects\\Debug\\AO2_vc8\\BuildLog.htm"
536>AO2 - 0 error(s), 0 warning(s)
537>Compiling...
537>soreduce.cpp
538>------ Build started: Project: mkcsregdb, Configuration: Debug Win32 ------
538>Compiling...
538>mkcsregdb.cpp
537>SO_Group.cpp
538>Compiling manifest to resources...
537>Signature.cpp
538>Linking...
538>Embedding manifest...
538>Build log was saved at "file://c:\\ace\\ACE_wrappers\\apps\\mkcsregdb\\Debug\\mkcsregdb_vc8\\BuildLog.htm"
538>mkcsregdb - 0 error(s), 0 warning(s)
537>Sig_List.cpp
539>------ Build started: Project: tinset, Configuration: Debug Win32 ------
539>Invoking ..\\..\\..\\bin\\gperf on corba.gperf
539>Compiling...
539>test.cpp
537>Obj_Module.cpp
539>corba.cpp
539>Generating Code...
539>Compiling manifest to resources...
539>Linking...
539>Embedding manifest...
537>Library.cpp
539>Build log was saved at "file://c:\\ace\\ACE_wrappers\\apps\\gperf\\tests\\Debug\\tinset_vc8\\BuildLog.htm"
539>tinset - 0 error(s), 0 warning(s)
540>------ Build started: Project: taoinset, Configuration: Debug Win32 ------
540>Invoking ..\\..\\..\\bin\\gperf on tao.gperf
540>12 input keysigs have identical hash values, examine output carefully...
540>Compiling...
540>test.cpp
537>Generating Code...
540>tao.cpp
540>Generating Code...
537>Compiling manifest to resources...
540>Compiling manifest to resources...
537>Linking...
540>Linking...
537>Embedding manifest...
540>Embedding manifest...
537>Build log was saved at "file://c:\\ace\\ACE_wrappers\\apps\\soreduce\\Debug\\soreduce_vc8\\BuildLog.htm"
537>soreduce - 0 error(s), 0 warning(s)
540>Build log was saved at "file://c:\\ace\\ACE_wrappers\\apps\\gperf\\tests\\Debug\\taoinset_vc8\\BuildLog.htm"
540>taoinset - 0 error(s), 0 warning(s)
541>------ Build started: Project: preinset, Configuration: Debug Win32 ------
541>Invoking ..\\..\\..\\bin\\gperf on adadefs.gperf
541>1 input keysigs have identical hash values, examine output carefully...
541>Compiling...
541>test.cpp
542>------ Build started: Project: pinset, Configuration: Debug Win32 ------
542>Invoking ..\\..\\..\\bin\\gperf on pascal.gperf
541>adadefs.cpp
542>Compiling...
541>Generating Code...
542>test.cpp
541>Compiling manifest to resources...
541>Linking...
541>Embedding manifest...
541>Build log was saved at "file://c:\\ace\\ACE_wrappers\\apps\\gperf\\tests\\Debug\\preinset_vc8\\BuildLog.htm"
541>preinset - 0 error(s), 0 warning(s)
542>pascal.cpp
542>Generating Code...
542>Compiling manifest to resources...
542>Linking...
542>Embedding manifest...
542>Build log was saved at "file://c:\\ace\\ACE_wrappers\\apps\\gperf\\tests\\Debug\\pinset_vc8\\BuildLog.htm"
542>pinset - 0 error(s), 0 warning(s)
543>------ Build started: Project: m3inset, Configuration: Debug Win32 ------
544>------ Build started: Project: Timer_Queue_Reference_Counting_Test, Configuration: Debug Win32 ------
543>Invoking ..\\..\\..\\bin\\gperf on modula3.gperf
544>Compiling...
544>Timer_Queue_Reference_Counting_Test.cpp
543>Compiling...
543>test.cpp
543>modula3.cpp
543>Generating Code...
543>Compiling manifest to resources...
543>Linking...
543>Embedding manifest...
544>c:\\ace\\ACE_wrappers\\ace/Timer_Hash_T.cpp(413) : warning C4244: 'initializing' : conversion from 'time_t' to 'size_t', possible loss of data
544> c:\\ace\\ACE_wrappers\\ace/Timer_Hash_T.cpp(409) : while compiling class template member function 'long ACE_Timer_Hash_T<TYPE,FUNCTOR,ACE_LOCK,BUCKET>::schedule_i(const TYPE &,const void *,const ACE_Time_Value &,const ACE_Time_Value &)'
544> with
544> [
544> TYPE=ACE_Event_Handler *,
544> FUNCTOR=ACE_Event_Handler_Handle_Timeout_Upcall<ACE_MT_SYNCH::RECURSIVE_MUTEX>,
544> ACE_LOCK=ACE_MT_SYNCH::RECURSIVE_MUTEX,
544> BUCKET=ACE_Hash_Timer_List
544> ]
544> .\\Timer_Queue_Reference_Counting_Test.cpp(265) : see reference to class template instantiation 'ACE_Timer_Hash_T<TYPE,FUNCTOR,ACE_LOCK,BUCKET>' being compiled
544> with
544> [
544> TYPE=ACE_Event_Handler *,
544> FUNCTOR=ACE_Event_Handler_Handle_Timeout_Upcall<ACE_MT_SYNCH::RECURSIVE_MUTEX>,
544> ACE_LOCK=ACE_MT_SYNCH::RECURSIVE_MUTEX,
544> BUCKET=ACE_Hash_Timer_List
544> ]
544> .\\Timer_Queue_Reference_Counting_Test.cpp(221) : while compiling class template member function 'cancellation_test<TIMER_QUEUE>::cancellation_test(const char *)'
544> with
544> [
544> TIMER_QUEUE=ACE_Timer_Hash
544> ]
544> .\\Timer_Queue_Reference_Counting_Test.cpp(635) : see reference to class template instantiation 'cancellation_test<TIMER_QUEUE>' being compiled
544> with
544> [
544> TIMER_QUEUE=ACE_Timer_Hash
544> ]
544>c:\\ace\\ACE_wrappers\\ace/Timer_Hash_T.cpp(378) : warning C4244: '=' : conversion from 'time_t' to 'size_t', possible loss of data
544> c:\\ace\\ACE_wrappers\\ace/Timer_Hash_T.cpp(370) : while compiling class template member function 'void ACE_Timer_Hash_T<TYPE,FUNCTOR,ACE_LOCK,BUCKET>::reschedule(ACE_Timer_Node_T<TYPE> *)'
544> with
544> [
544> TYPE=ACE_Event_Handler *,
544> FUNCTOR=ACE_Event_Handler_Handle_Timeout_Upcall<ACE_MT_SYNCH::RECURSIVE_MUTEX>,
544> ACE_LOCK=ACE_MT_SYNCH::RECURSIVE_MUTEX,
544> BUCKET=ACE_Hash_Timer_List
544> ]
544>Main.cpp
543>Build log was saved at "file://c:\\ace\\ACE_wrappers\\apps\\gperf\\tests\\Debug\\m3inset_vc8\\BuildLog.htm"
543>m3inset - 0 error(s), 0 warning(s)
544>Generating Code...
545>------ Build started: Project: iinset2, Configuration: Debug Win32 ------
545>Invoking ..\\..\\..\\bin\\gperf on idl.gperf
545>GPERF: Automatically changing to -S1 switch option
544>Compiling manifest to resources...
545>Compiling...
544>Linking...
545>test.cpp
544> Creating library .\\Timer_Queue_Reference_Counting_Test.lib and object .\\Timer_Queue_Reference_Counting_Test.exp
544>Embedding manifest...
544>Build log was saved at "file://c:\\ace\\ACE_wrappers\\tests\\Debug\\Timer_Queue_Reference_Counting_Test_vc8\\BuildLog.htm"
544>Timer_Queue_Reference_Counting_Test - 0 error(s), 2 warning(s)
545>idl.cpp
545>Generating Code...
545>Compiling manifest to resources...
545>Linking...
545>Embedding manifest...
546>------ Build started: Project: cppinset, Configuration: Debug Win32 ------
546>Invoking ..\\..\\..\\bin\\gperf on cpp.gperf
546>3 input keysigs have identical hash values, examine output carefully...
546>Compiling...
546>test.cpp
545>Build log was saved at "file://c:\\ace\\ACE_wrappers\\apps\\gperf\\tests\\Debug\\iinset2_vc8\\BuildLog.htm"
545>iinset2 - 0 error(s), 0 warning(s)
547>------ Build started: Project: cinset, Configuration: Debug Win32 ------
547>Invoking ..\\..\\..\\bin\\gperf on c.gperf
547>Compiling...
547>test.cpp
546>cpp.cpp
546>Generating Code...
546>Compiling manifest to resources...
546>Linking...
546>Embedding manifest...
547>c.cpp
547>Generating Code...
547>Compiling manifest to resources...
547>Linking...
546>Build log was saved at "file://c:\\ace\\ACE_wrappers\\apps\\gperf\\tests\\Debug\\cppinset_vc8\\BuildLog.htm"
546>cppinset - 0 error(s), 0 warning(s)
547>Embedding manifest...
547>Build log was saved at "file://c:\\ace\\ACE_wrappers\\apps\\gperf\\tests\\Debug\\cinset_vc8\\BuildLog.htm"
547>cinset - 0 error(s), 0 warning(s)
548>------ Build started: Project: adainset, Configuration: Debug Win32 ------
549>------ Build started: Project: Timer_Queue_Test, Configuration: Debug Win32 ------
548>Invoking ..\\..\\..\\bin\\gperf on ada.gperf
549>Compiling...
549>Timer_Queue_Test.cpp
548>Compiling...
548>test.cpp
548>ada.cpp
548>Generating Code...
548>Compiling manifest to resources...
548>Linking...
548>Embedding manifest...
549>.\\Timer_Queue_Test.cpp(571) : warning C4244: 'argument' : conversion from 'time_t' to 'u_int', possible loss of data
549>c:\\ace\\ACE_wrappers\\ace/Timer_Hash_T.cpp(413) : warning C4244: 'initializing' : conversion from 'time_t' to 'size_t', possible loss of data
549> c:\\ace\\ACE_wrappers\\ace/Timer_Hash_T.cpp(409) : while compiling class template member function 'long ACE_Timer_Hash_T<TYPE,FUNCTOR,ACE_LOCK,BUCKET>::schedule_i(const TYPE &,const void *,const ACE_Time_Value &,const ACE_Time_Value &)'
549> with
549> [
549> TYPE=ACE_Event_Handler *,
549> FUNCTOR=ACE_Event_Handler_Handle_Timeout_Upcall<ACE_MT_SYNCH::RECURSIVE_MUTEX>,
549> ACE_LOCK=ACE_MT_SYNCH::RECURSIVE_MUTEX,
549> BUCKET=ACE_Hash_Timer_List
549> ]
549> .\\Timer_Queue_Test.cpp(595) : see reference to class template instantiation 'ACE_Timer_Hash_T<TYPE,FUNCTOR,ACE_LOCK,BUCKET>' being compiled
549> with
549> [
549> TYPE=ACE_Event_Handler *,
549> FUNCTOR=ACE_Event_Handler_Handle_Timeout_Upcall<ACE_MT_SYNCH::RECURSIVE_MUTEX>,
549> ACE_LOCK=ACE_MT_SYNCH::RECURSIVE_MUTEX,
549> BUCKET=ACE_Hash_Timer_List
549> ]
549>c:\\ace\\ACE_wrappers\\ace/Timer_Hash_T.cpp(378) : warning C4244: '=' : conversion from 'time_t' to 'size_t', possible loss of data
549> c:\\ace\\ACE_wrappers\\ace/Timer_Hash_T.cpp(370) : while compiling class template member function 'void ACE_Timer_Hash_T<TYPE,FUNCTOR,ACE_LOCK,BUCKET>::reschedule(ACE_Timer_Node_T<TYPE> *)'
549> with
549> [
549> TYPE=ACE_Event_Handler *,
549> FUNCTOR=ACE_Event_Handler_Handle_Timeout_Upcall<ACE_MT_SYNCH::RECURSIVE_MUTEX>,
549> ACE_LOCK=ACE_MT_SYNCH::RECURSIVE_MUTEX,
549> BUCKET=ACE_Hash_Timer_List
549> ]
549>c:\\ace\\ACE_wrappers\\ace/Timer_Hash_T.cpp(413) : warning C4244: 'initializing' : conversion from 'time_t' to 'size_t', possible loss of data
549> c:\\ace\\ACE_wrappers\\ace/Timer_Hash_T.cpp(409) : while compiling class template member function 'long ACE_Timer_Hash_T<TYPE,FUNCTOR,ACE_LOCK,BUCKET>::schedule_i(const TYPE &,const void *,const ACE_Time_Value &,const ACE_Time_Value &)'
549> with
549> [
549> TYPE=ACE_Event_Handler *,
549> FUNCTOR=ACE_Event_Handler_Handle_Timeout_Upcall<ACE_MT_SYNCH::RECURSIVE_MUTEX>,
549> ACE_LOCK=ACE_MT_SYNCH::RECURSIVE_MUTEX,
549> BUCKET=ACE_Hash_Timer_Heap
549> ]
549> .\\Timer_Queue_Test.cpp(588) : see reference to class template instantiation 'ACE_Timer_Hash_T<TYPE,FUNCTOR,ACE_LOCK,BUCKET>' being compiled
549> with
549> [
549> TYPE=ACE_Event_Handler *,
549> FUNCTOR=ACE_Event_Handler_Handle_Timeout_Upcall<ACE_MT_SYNCH::RECURSIVE_MUTEX>,
549> ACE_LOCK=ACE_MT_SYNCH::RECURSIVE_MUTEX,
549> BUCKET=ACE_Hash_Timer_Heap
549> ]
549>c:\\ace\\ACE_wrappers\\ace/Timer_Hash_T.cpp(378) : warning C4244: '=' : conversion from 'time_t' to 'size_t', possible loss of data
549> c:\\ace\\ACE_wrappers\\ace/Timer_Hash_T.cpp(370) : while compiling class template member function 'void ACE_Timer_Hash_T<TYPE,FUNCTOR,ACE_LOCK,BUCKET>::reschedule(ACE_Timer_Node_T<TYPE> *)'
549> with
549> [
549> TYPE=ACE_Event_Handler *,
549> FUNCTOR=ACE_Event_Handler_Handle_Timeout_Upcall<ACE_MT_SYNCH::RECURSIVE_MUTEX>,
549> ACE_LOCK=ACE_MT_SYNCH::RECURSIVE_MUTEX,
549> BUCKET=ACE_Hash_Timer_Heap
549> ]
549>Main.cpp
548>Build log was saved at "file://c:\\ace\\ACE_wrappers\\apps\\gperf\\tests\\Debug\\adainset_vc8\\BuildLog.htm"
548>adainset - 0 error(s), 0 warning(s)
549>Generating Code...
549>Compiling manifest to resources...
549>Linking...
549> Creating library .\\Timer_Queue_Test.lib and object .\\Timer_Queue_Test.exp
549>Embedding manifest...
550>------ Build started: Project: Token_Strategy_Test, Configuration: Debug Win32 ------
549>Build log was saved at "file://c:\\ace\\ACE_wrappers\\tests\\Debug\\Timer_Queue_Test_vc8\\BuildLog.htm"
549>Timer_Queue_Test - 0 error(s), 5 warning(s)
550>Compiling...
550>Token_Strategy_Test.cpp
551>------ Build started: Project: JAWS3_server, Configuration: Debug Win32 ------
551>Compiling...
551>main.cpp
550>Main.cpp
550>Generating Code...
550>Compiling manifest to resources...
550>Linking...
550>Embedding manifest...
550>Build log was saved at "file://c:\\ace\\ACE_wrappers\\tests\\Debug\\Token_Strategy_Test_vc8\\BuildLog.htm"
550>Token_Strategy_Test - 0 error(s), 0 warning(s)
552>------ Build started: Project: JAWS2, Configuration: Debug Win32 ------
551>Compiling manifest to resources...
551>Linking...
552>Compiling...
552>Waiter.cpp
551>Embedding manifest...
551>Build log was saved at "file://c:\\ace\\ACE_wrappers\\apps\\JAWS3\\jaws3\\Debug\\JAWS3_server_vc8\\BuildLog.htm"
551>JAWS3_server - 0 error(s), 0 warning(s)
553>------ Build started: Project: Tokens_Test, Configuration: Debug Win32 ------
553>Compiling...
553>Tokens_Test.cpp
552>Server.cpp
553>Main.cpp
553>Generating Code...
553>Compiling manifest to resources...
553>Linking...
553>Embedding manifest...
552>Reaper.cpp
553>Build log was saved at "file://c:\\ace\\ACE_wrappers\\tests\\Debug\\Tokens_Test_vc8\\BuildLog.htm"
553>Tokens_Test - 0 error(s), 0 warning(s)
554>------ Build started: Project: JAWS_server, Configuration: Debug Win32 ------
554>Compiling...
554>main.cpp
552>Policy.cpp
554>Compiling manifest to resources...
554>Linking...
552>Pipeline_Tasks.cpp
554>Embedding manifest...
554>Build log was saved at "file://c:\\ace\\ACE_wrappers\\apps\\JAWS\\server\\Debug\\JAWS_server_vc8\\BuildLog.htm"
554>JAWS_server - 0 error(s), 0 warning(s)
555>------ Build started: Project: http_client, Configuration: Debug Win32 ------
555>Compiling...
555>http_handler.cpp
552>Pipeline.cpp
552>Parse_Headers.cpp
555>http_client.cpp
552>IO_Handler.cpp
555>Generating Code...
555>Compiling manifest to resources...
555>Linking...
555> Creating library .\\http_clientd.lib and object .\\http_clientd.exp
555>Embedding manifest...
555>Build log was saved at "file://c:\\ace\\ACE_wrappers\\apps\\JAWS\\clients\\Caching\\Debug\\http_client_vc8\\BuildLog.htm"
555>http_client - 0 error(s), 0 warning(s)
552>IO_Acceptor.cpp
556>------ Build started: Project: blobby, Configuration: Debug Win32 ------
556>Compiling...
556>Options.cpp
552>IO.cpp
556>blobby.cpp
552>.\\IO.cpp(226) : warning C4244: 'argument' : conversion from 'ACE_LOFF_T' to 'size_t', possible loss of data
552>Headers.cpp
552>Filecache.cpp
556>Blob_Handler.cpp
552>.\\Filecache.cpp(58) : warning C4244: 'argument' : conversion from 'ACE_LOFF_T' to 'size_t', possible loss of data
552>FILE.cpp
556>Blob.cpp
552>Data_Block.cpp
556>Generating Code...
556>Compiling manifest to resources...
556>Linking...
556> Creating library .\\blobby.lib and object .\\blobby.exp
552>Concurrency.cpp
556>Embedding manifest...
556>Build log was saved at "file://c:\\ace\\ACE_wrappers\\apps\\JAWS\\clients\\Blobby\\Debug\\blobby_vc8\\BuildLog.htm"
556>blobby - 0 error(s), 0 warning(s)
557>------ Build started: Project: gateway_peerd, Configuration: Debug Win32 ------
552>Cache_Object.cpp
557>Compiling...
557>peerd.cpp
552>Cache_Manager.cpp
557>Compiling manifest to resources...
557>Linking...
552>Assoc_Array.cpp
557>Embedding manifest...
552>Generating Code...
557>Build log was saved at "file://c:\\ace\\ACE_wrappers\\apps\\Gateway\\Peer\\Debug\\gateway_peerd_vc8\\BuildLog.htm"
557>gateway_peerd - 0 error(s), 0 warning(s)
558>------ Build started: Project: UPIPE_SAP_Test, Configuration: Debug Win32 ------
558>Compiling...
558>UPIPE_SAP_Test.cpp
552>Compiling manifest to resources...
552>Linking...
552> Creating library ..\\..\\..\\lib\\JAWS2d.lib and object ..\\..\\..\\lib\\JAWS2d.exp
552>Embedding manifest...
552>Build log was saved at "file://c:\\ace\\ACE_wrappers\\apps\\JAWS2\\JAWS\\Debug\\JAWS2_vc8\\BuildLog.htm"
552>JAWS2 - 0 error(s), 2 warning(s)
558>Main.cpp
558>Generating Code...
559>------ Build started: Project: gatewayd, Configuration: Debug Win32 ------
558>Compiling manifest to resources...
558>Linking...
559>Compiling...
558> Creating library .\\UPIPE_SAP_Test.lib and object .\\UPIPE_SAP_Test.exp
559>gatewayd.cpp
558>Embedding manifest...
558>Build log was saved at "file://c:\\ace\\ACE_wrappers\\tests\\Debug\\UPIPE_SAP_Test_vc8\\BuildLog.htm"
558>UPIPE_SAP_Test - 0 error(s), 0 warning(s)
560>------ Build started: Project: UUIDTest, Configuration: Debug Win32 ------
559>Compiling manifest to resources...
559>Linking...
560>Compiling...
560>UUIDTest.cpp
559>Embedding manifest...
559>Build log was saved at "file://c:\\ace\\ACE_wrappers\\apps\\Gateway\\Gateway\\Debug\\gatewayd_vc8\\BuildLog.htm"
559>gatewayd - 0 error(s), 0 warning(s)
561>------ Build started: Project: Unbounded_Set_Test, Configuration: Debug Win32 ------
561>Compiling...
560>Main.cpp
561>Unbounded_Set_Test.cpp
560>Generating Code...
560>Compiling manifest to resources...
560>Linking...
560> Creating library .\\UUIDTest.lib and object .\\UUIDTest.exp
560>Embedding manifest...
561>Main.cpp
560>Build log was saved at "file://c:\\ace\\ACE_wrappers\\tests\\Debug\\UUIDTest_vc8\\BuildLog.htm"
560>UUIDTest - 0 error(s), 0 warning(s)
561>Generating Code...
561>Compiling manifest to resources...
561>Linking...
561>Embedding manifest...
562>------ Build started: Project: Upgradable_RW_Test, Configuration: Debug Win32 ------
562>Compiling...
562>Upgradable_RW_Test.cpp
561>Build log was saved at "file://c:\\ace\\ACE_wrappers\\tests\\Debug\\Unbounded_Set_Test_vc8\\BuildLog.htm"
561>Unbounded_Set_Test - 0 error(s), 0 warning(s)
563>------ Build started: Project: FIFO, Configuration: Debug Win32 ------
563>Compiling...
563>test.cpp
562>Main.cpp
562>Generating Code...
562>Compiling manifest to resources...
562>Linking...
562> Creating library .\\Upgradable_RW_Test.lib and object .\\Upgradable_RW_Test.exp
562>Embedding manifest...
563>Compiling manifest to resources...
563>Linking...
563>Embedding manifest...
562>Build log was saved at "file://c:\\ace\\ACE_wrappers\\tests\\Debug\\Upgradable_RW_Test_vc8\\BuildLog.htm"
562>Upgradable_RW_Test - 0 error(s), 0 warning(s)
563>Build log was saved at "file://c:\\ace\\ACE_wrappers\\Kokyu\\tests\\FIFO\\Debug\\FIFO_vc8\\BuildLog.htm"
563>FIFO - 0 error(s), 0 warning(s)
564>------ Build started: Project: EDF, Configuration: Debug Win32 ------
564>Compiling...
564>test.cpp
565>------ Build started: Project: DSRT_MIF, Configuration: Debug Win32 ------
565>Compiling...
565>MIF.cpp
564>Compiling manifest to resources...
564>Linking...
564>Embedding manifest...
564>Build log was saved at "file://c:\\ace\\ACE_wrappers\\Kokyu\\tests\\EDF\\Debug\\EDF_vc8\\BuildLog.htm"
564>EDF - 0 error(s), 0 warning(s)
565>Compiling manifest to resources...
565>Linking...
565> Creating library .\\MIF.lib and object .\\MIF.exp
565>Embedding manifest...
566>------ Build started: Project: Vector_Test, Configuration: Debug Win32 ------
566>Compiling...
566>Vector_Test.cpp
566>Main.cpp
566>Generating Code...
566>Compiling manifest to resources...
566>Linking...
565>Build log was saved at "file://c:\\ace\\ACE_wrappers\\Kokyu\\tests\\DSRT_MIF\\Debug\\DSRT_MIF_vc8\\BuildLog.htm"
565>DSRT_MIF - 0 error(s), 0 warning(s)
566>Embedding manifest...
567>------ Build started: Project: asnmp_tests_Varbind_Test, Configuration: Debug Win32 ------
567>Compiling...
566>Build log was saved at "file://c:\\ace\\ACE_wrappers\\tests\\Debug\\Vector_Test_vc8\\BuildLog.htm"
566>Vector_Test - 0 error(s), 0 warning(s)
567>Varbind_Test.cpp
568>------ Build started: Project: asnmp_tests_Target_Test, Configuration: Debug Win32 ------
568>Compiling...
568>Target_Test.cpp
567>c:\\ace\\ace_wrappers\\asnmp\\tests\\test_config.h(185) : warning C4244: 'argument' : conversion from 'time_t' to 'u_int', possible loss of data
567>Compiling manifest to resources...
567>Linking...
568>c:\\ace\\ace_wrappers\\asnmp\\tests\\test_config.h(185) : warning C4244: 'argument' : conversion from 'time_t' to 'u_int', possible loss of data
567>Embedding manifest...
568>Compiling manifest to resources...
568>Linking...
567>Build log was saved at "file://c:\\ace\\ACE_wrappers\\ASNMP\\tests\\Debug\\asnmp_tests_Varbind_Test_vc8\\BuildLog.htm"
567>asnmp_tests_Varbind_Test - 0 error(s), 1 warning(s)
568>Embedding manifest...
569>------ Build started: Project: asnmp_tests_Oid_Test, Configuration: Debug Win32 ------
569>Compiling...
569>Oid_Test.cpp
569>c:\\ace\\ace_wrappers\\asnmp\\tests\\test_config.h(185) : warning C4244: 'argument' : conversion from 'time_t' to 'u_int', possible loss of data
569>Compiling manifest to resources...
569>Linking...
568>Build log was saved at "file://c:\\ace\\ACE_wrappers\\ASNMP\\tests\\Debug\\asnmp_tests_Target_Test_vc8\\BuildLog.htm"
568>asnmp_tests_Target_Test - 0 error(s), 1 warning(s)
569>Embedding manifest...
570>------ Build started: Project: asnmp_tests_Octet_Test, Configuration: Debug Win32 ------
569>Build log was saved at "file://c:\\ace\\ACE_wrappers\\ASNMP\\tests\\Debug\\asnmp_tests_Oid_Test_vc8\\BuildLog.htm"
569>asnmp_tests_Oid_Test - 0 error(s), 1 warning(s)
570>Compiling...
570>Octet_Test.cpp
571>------ Build started: Project: asnmp_tests_Integer_Test, Configuration: Debug Win32 ------
571>Compiling...
571>Integer_Test.cpp
570>c:\\ace\\ace_wrappers\\asnmp\\tests\\test_config.h(185) : warning C4244: 'argument' : conversion from 'time_t' to 'u_int', possible loss of data
570>Compiling manifest to resources...
570>Linking...
570>Embedding manifest...
570>Build log was saved at "file://c:\\ace\\ACE_wrappers\\ASNMP\\tests\\Debug\\asnmp_tests_Octet_Test_vc8\\BuildLog.htm"
570>asnmp_tests_Octet_Test - 0 error(s), 1 warning(s)
571>c:\\ace\\ace_wrappers\\asnmp\\tests\\test_config.h(185) : warning C4244: 'argument' : conversion from 'time_t' to 'u_int', possible loss of data
572>------ Build started: Project: asnmp_tests_Gauge_Test, Configuration: Debug Win32 ------
571>Compiling manifest to resources...
571>Linking...
572>Compiling...
572>Gauge_Test.cpp
571>Embedding manifest...
571>Build log was saved at "file://c:\\ace\\ACE_wrappers\\ASNMP\\tests\\Debug\\asnmp_tests_Integer_Test_vc8\\BuildLog.htm"
571>asnmp_tests_Integer_Test - 0 error(s), 1 warning(s)
573>------ Build started: Project: asnmp_tests_Counter_Test, Configuration: Debug Win32 ------
573>Compiling...
573>Counter_Test.cpp
572>c:\\ace\\ace_wrappers\\asnmp\\tests\\test_config.h(185) : warning C4244: 'argument' : conversion from 'time_t' to 'u_int', possible loss of data
572>Compiling manifest to resources...
572>Linking...
572>Embedding manifest...
572>Build log was saved at "file://c:\\ace\\ACE_wrappers\\ASNMP\\tests\\Debug\\asnmp_tests_Gauge_Test_vc8\\BuildLog.htm"
572>asnmp_tests_Gauge_Test - 0 error(s), 1 warning(s)
573>c:\\ace\\ace_wrappers\\asnmp\\tests\\test_config.h(185) : warning C4244: 'argument' : conversion from 'time_t' to 'u_int', possible loss of data
573>Compiling manifest to resources...
573>Linking...
573>Embedding manifest...
573>Build log was saved at "file://c:\\ace\\ACE_wrappers\\ASNMP\\tests\\Debug\\asnmp_tests_Counter_Test_vc8\\BuildLog.htm"
573>asnmp_tests_Counter_Test - 0 error(s), 1 warning(s)
574>------ Build started: Project: asnmp_tests_Counter64_Test, Configuration: Debug Win32 ------
575>------ Build started: Project: asnmp_tests_Address_Test, Configuration: Debug Win32 ------
574>Compiling...
575>Compiling...
574>Counter64_Test.cpp
575>Address_Test.cpp
574>c:\\ace\\ace_wrappers\\asnmp\\tests\\test_config.h(185) : warning C4244: 'argument' : conversion from 'time_t' to 'u_int', possible loss of data
575>c:\\ace\\ace_wrappers\\asnmp\\tests\\test_config.h(185) : warning C4244: 'argument' : conversion from 'time_t' to 'u_int', possible loss of data
574>Compiling manifest to resources...
574>Linking...
575>Compiling manifest to resources...
575>Linking...
574>Embedding manifest...
575>Embedding manifest...
574>Build log was saved at "file://c:\\ace\\ACE_wrappers\\ASNMP\\tests\\Debug\\asnmp_tests_Counter64_Test_vc8\\BuildLog.htm"
574>asnmp_tests_Counter64_Test - 0 error(s), 1 warning(s)
575>Build log was saved at "file://c:\\ace\\ACE_wrappers\\ASNMP\\tests\\Debug\\asnmp_tests_Address_Test_vc8\\BuildLog.htm"
575>asnmp_tests_Address_Test - 0 error(s), 1 warning(s)
576>------ Build started: Project: asnmp_example_walk, Configuration: Debug Win32 ------
576>Compiling...
576>walk.cpp
577>------ Build started: Project: asnmp_example_trap, Configuration: Debug Win32 ------
577>Compiling...
577>trap.cpp
576>Compiling manifest to resources...
576>Linking...
576>Embedding manifest...
577>Compiling manifest to resources...
577>Linking...
576>Build log was saved at "file://c:\\ace\\ACE_wrappers\\ASNMP\\examples\\walk\\Debug\\asnmp_example_walk_vc8\\BuildLog.htm"
576>asnmp_example_walk - 0 error(s), 0 warning(s)
578>------ Build started: Project: asnmp_example_set, Configuration: Debug Win32 ------
577>Embedding manifest...
578>Compiling...
578>set.cpp
577>Build log was saved at "file://c:\\ace\\ACE_wrappers\\ASNMP\\examples\\trap\\Debug\\asnmp_example_trap_vc8\\BuildLog.htm"
577>asnmp_example_trap - 0 error(s), 0 warning(s)
579>------ Build started: Project: asnmp_example_next, Configuration: Debug Win32 ------
579>Compiling...
579>next.cpp
578>Compiling manifest to resources...
578>Linking...
578>Embedding manifest...
578>Build log was saved at "file://c:\\ace\\ACE_wrappers\\ASNMP\\examples\\set\\Debug\\asnmp_example_set_vc8\\BuildLog.htm"
578>asnmp_example_set - 0 error(s), 0 warning(s)
579>Compiling manifest to resources...
579>Linking...
579>Embedding manifest...
579>Build log was saved at "file://c:\\ace\\ACE_wrappers\\ASNMP\\examples\\next\\Debug\\asnmp_example_next_vc8\\BuildLog.htm"
579>asnmp_example_next - 0 error(s), 0 warning(s)
580>------ Build started: Project: asnmp_example_get, Configuration: Debug Win32 ------
581>------ Build started: Project: asnmp_example_get_async, Configuration: Debug Win32 ------
580>Compiling...
581>Compiling...
580>get.cpp
581>get_async.cpp
581>Compiling manifest to resources...
580>Compiling manifest to resources...
580>Linking...
581>Linking...
581>Embedding manifest...
580>Embedding manifest...
580>Build log was saved at "file://c:\\ace\\ACE_wrappers\\ASNMP\\examples\\get\\Debug\\asnmp_example_get_vc8\\BuildLog.htm"
580>asnmp_example_get - 0 error(s), 0 warning(s)
581>Build log was saved at "file://c:\\ace\\ACE_wrappers\\ASNMP\\examples\\get\\Debug\\asnmp_example_get_async_vc8\\BuildLog.htm"
581>asnmp_example_get_async - 0 error(s), 0 warning(s)
582>------ Build started: Project: WFMO_Reactor_Test, Configuration: Debug Win32 ------
582>Compiling...
582>WFMO_Reactor_Test.cpp
583>------ Build started: Project: asnmp_agent, Configuration: Debug Win32 ------
583>Compiling...
583>snmp_agent.cpp
582>Main.cpp
583>main.cpp
582>Generating Code...
582>Compiling manifest to resources...
582>Linking...
582>Embedding manifest...
583>agent_impl.cpp
582>Build log was saved at "file://c:\\ace\\ACE_wrappers\\tests\\Debug\\WFMO_Reactor_Test_vc8\\BuildLog.htm"
582>WFMO_Reactor_Test - 0 error(s), 0 warning(s)
584>------ Build started: Project: util, Configuration: Debug Win32 ------
584>Compiling...
584>test.cpp
583>Generating Code...
583>Compiling manifest to resources...
583>Linking...
583>Embedding manifest...
584>Compiling manifest to resources...
584>Linking...
583>Build log was saved at "file://c:\\ace\\ACE_wrappers\\ASNMP\\agent\\Debug\\asnmp_agent_vc8\\BuildLog.htm"
583>asnmp_agent - 0 error(s), 0 warning(s)
584>Embedding manifest...
585>------ Build started: Project: Transcoder_Test, Configuration: Debug Win32 ------
584>Build log was saved at "file://c:\\ace\\ACE_wrappers\\ACEXML\\tests\\util\\Debug\\util_vc8\\BuildLog.htm"
584>util - 0 error(s), 0 warning(s)
585>Compiling...
585>Transcoder_Test.cpp
586>------ Build started: Project: NamespaceSupport_Test, Configuration: Debug Win32 ------
586>Compiling...
585>Compiling manifest to resources...
585>Linking...
586>NamespaceSupport_Test.cpp
585>Embedding manifest...
585>Build log was saved at "file://c:\\ace\\ACE_wrappers\\ACEXML\\tests\\Debug\\Transcoder_Test_vc8\\BuildLog.htm"
585>Transcoder_Test - 0 error(s), 0 warning(s)
587>------ Build started: Project: HttpCharStream_Test, Configuration: Debug Win32 ------
587>Compiling...
587>HttpCharStream_Test.cpp
586>Compiling manifest to resources...
586>Linking...
586>Embedding manifest...
586>Build log was saved at "file://c:\\ace\\ACE_wrappers\\ACEXML\\tests\\Debug\\NamespaceSupport_Test_vc8\\BuildLog.htm"
586>NamespaceSupport_Test - 0 error(s), 0 warning(s)
588>------ Build started: Project: ContentHandler_Test, Configuration: Debug Win32 ------
587>Compiling manifest to resources...
587>Linking...
588>Compiling...
588>ContentHandler_Test.cpp
587>Embedding manifest...
587>Build log was saved at "file://c:\\ace\\ACE_wrappers\\ACEXML\\tests\\Debug\\HttpCharStream_Test_vc8\\BuildLog.htm"
587>HttpCharStream_Test - 0 error(s), 0 warning(s)
589>------ Build started: Project: Proactor_Cancel, Configuration: Debug Win32 ------
589>Compiling...
589>test_cancel.cpp
588>Compiling manifest to resources...
588>Linking...
588> Creating library .\\ContentHandler_Test.lib and object .\\ContentHandler_Test.exp
588>Embedding manifest...
588>Build log was saved at "file://c:\\ace\\ACE_wrappers\\ACEXML\\tests\\Debug\\ContentHandler_Test_vc8\\BuildLog.htm"
588>ContentHandler_Test - 0 error(s), 0 warning(s)
589>Compiling manifest to resources...
589>Linking...
589> Creating library .\\test_cancel.lib and object .\\test_cancel.exp
590>------ Build started: Project: SAXPrint, Configuration: Debug Win32 ------
589>Embedding manifest...
590>Compiling...
590>SAXPrint_Handler.cpp
589>Build log was saved at "file://c:\\ace\\ACE_wrappers\\examples\\Reactor\\Proactor\\Debug\\Proactor_Cancel_vc8\\BuildLog.htm"
589>Proactor_Cancel - 0 error(s), 0 warning(s)
591>------ Build started: Project: Websvcs_Test, Configuration: Debug Win32 ------
591>Compiling...
591>Test_URL_Addr.cpp
590>Print_Handler.cpp
591>Compiling manifest to resources...
591>Linking...
590>main.cpp
591>Embedding manifest...
591>Build log was saved at "file://c:\\ace\\ACE_wrappers\\websvcs\\tests\\Debug\\Websvcs_Test_vc8\\BuildLog.htm"
591>Websvcs_Test - 0 error(s), 0 warning(s)
592>------ Build started: Project: ACEXML_XML_Svc_Conf_Parser, Configuration: Debug Win32 ------
592>Compiling...
592>Svcconf_Handler.cpp
590>Generating Code...
590>Compiling manifest to resources...
590>Linking...
590> Creating library .\\SAXPrint.lib and object .\\SAXPrint.exp
590>Embedding manifest...
592>Svcconf.cpp
590>Build log was saved at "file://c:\\ace\\ACE_wrappers\\ACEXML\\examples\\SAXPrint\\Debug\\SAXPrint_vc8\\BuildLog.htm"
590>SAXPrint - 0 error(s), 0 warning(s)
592>Generating Code...
592>Compiling manifest to resources...
592>Linking...
592>Embedding manifest...
592>Build log was saved at "file://c:\\ace\\ACE_wrappers\\ACEXML\\apps\\svcconf\\Debug\\ACEXML_XML_Svc_Conf_Parser_vc8\\BuildLog.htm"
592>ACEXML_XML_Svc_Conf_Parser - 0 error(s), 0 warning(s)
========== Build: 591 succeeded, 1 failed, 1 up-to-date, 0 skipped ==========[/list:u:1a8eccde37]

I don't know if i can post somemuch if not sorry

This is my ACE build log but it gave an few errors and i think if the errors wheren't there that i can compile COHEMU but i can't now because when i try to compile COHEMU it give's many errors

User avatar
Fork
Posts: 215
Joined: Sat Apr 19, 2008 8:12 pm

Post by Fork » Fri Nov 03, 2006 9:00 pm


Post Reply

Who is online

Users browsing this forum: No registered users and 3 guests